Ontologie des Objets de Repères
type: Ontology
version IRI: http://purl.org/choucas.ign.fr/oor/1.0.0
licence: http://creativecommons.org/licenses/by/4.0/
creator: Ana-Maria Raimond
creator: Catherine Dominguès
creator: Cecile Duchêne
creator: Laurence Jolivet
creator: Marie-Dominique Van Damme
creator: Mattia Bunel
creator: Olivier Favre
creator: Sebastien Mustière
creator: Véronique Gendner
description: Ontologie des objets géographiques pouvant servir d objets de référence dans le cadre de la localisation de personnes dans un contexte de montagne. Cette ontologie a été proposée dans le cadre du projet Choucas (ANR-16-CE23-0018). Elle est inspiré de l Ontologie GeOnto (Mustière et al., 2011) et LFRO (Sinha, Gaurav et al. 2018. ) Mustière Sébastien, Nathalie Abadie, Nathalie Aussenac- Gilles, Marie-Noelle Bessagnet, Mouna Kamel, et al.. Analyses linguistiques et techniques d alignement pour créer et enrichir une ontologie topographique. Revue Internationale de Géomatique, Lavoisier, 2011, 21 (2), pp.155-180 Sinha, Gaurav et al. 2018. ‘The Landform Reference Ontology (LFRO): A Foundation for Exploring Linguistic and Geospatial Conceptualization of Landforms (Short Paper)’. Schloss Dagstuhl - Leibniz-Zentrum fuer Informatik GmbH, Wadern/Saarbruecken, Germany.
description: Ontology of geographical objects used as reference objects in a mountain context. This ontology is proposed during ANR Choucas project (ANR-16-CE23-0018). It is inspired from GeOnto Ontology (Mustière et al., 2011) et LFRO ontology (Sinha, Gaurav et al. 2018). Mustière Sébastien, Nathalie Abadie, Nathalie Aussenac- Gilles, Marie-Noelle Bessagnet, Mouna Kamel, et al Analyses linguistiques et techniques d alignement pour créer et enrichir une ontologie topographique. Revue Internationale de Géomatique, Lavoisier, 2011, 21 (2), pp.155-180 Sinha, Gaurav et al. 2018. ‘The Landform Reference Ontology (LFRO): A Foundation for Exploring Linguistic and Geospatial Conceptualization of Landforms (Short Paper)’. Schloss Dagstuhl - Leibniz-Zentrum fuer Informatik GmbH, Wadern/Saarbruecken, Germany. @en
issued: 2020-01-28
modified: 2025-08-14
publisher: ANR CHOUCAS - LASTIG/IGN
rights: Copyright © 2022 Choucas/LASTIG @en
title: Ontology Of landmaRks @en
preferred namespace prefix: OOR
preferred namespace uri: URI DU NAMESPACE
version info: 1.0.1

aPourCouleur
type: ObjectProperty
comment: Pour modéliser la couleur d un objet (ex. une maison jaune)

aPourForme
type: ObjectProperty
sub property of: topObjectProperty
comment: pour modéliser la forme d un objet (ex. un lac rond)

peutEtreCoLocaliséAvec
type: ObjectProperty
comment: Pour modéliser des objets liés sur le terrain ; il s’agit des objets qui peuvent être en concurrence de par leur nature ou leur fonction (ex : port êtreColocaliséAvec quai ; rymayé êtreColocaliséAvec glacier ; pied êtreColocaliséAvec montagne) ;

peutEtreComposéDe
type: ObjectProperty
comment: Permet de modéliser le fait qu en objet peut peut être composé par plusiers objets

peutEtreConfonduAvec
type: ObjectProperty
comment: pour modéliser les objets qui peuvent être confondu de par leur forme (ex : ligne électrique peutEtreConfonduAvec cable transporteur) ou par leur usage (ex. cabane/refuge)

type de composition du peuplement
type: ObjectProperty
domain: forêt
range: Composition du peuplement en 3 classes
comment: Pour modéliser la composition dominante des types de formation végétale (ex. feuillus, conifères) à une zone forestière.
comment: To characterize the dominant stand composition of vegetation types (e.g., deciduous, coniferous) within a forest area. @en
label: type of stand composition @en

topObjectProperty
comment: Ces propriétés ne sont pas instanciées dans cette version d’OOR

rupture de pente
type: Class
subclass of: verticale
comment: Regroupe des éléments ayant une tendance verticale et on retrouve la notion d aggravation de la pente.
preferred label: slope break @en

plateau adouci de forme allongée
type: Class
subclass of: plateau adouci
comment: Regroupe des éléments ayant une notion d horizontalité situés pas très loin du pied de la montagne
preferred label: elongated gently sloping plateau @en

plateau adouci de forme compacte
type: Class
subclass of: plateau adouci
comment: Regroupe des élements ayant une notion d horizontalité situés dans la partie haute de la montagne
preferred label: compacted gently sloping plateau @en

Composition du peuplement en 3 classes
type: Class
subclass of: Nomenclature de la couche forestière
comment: Composition du peuplement recensable en 3 classes (FEUILLU / RESINEUX / MIXTES)
preferred label: Stand composition in 3 classes @en

Nomenclature de la couche forestière
type: Class
subclass of: Concept
comment: Nomenclature de la composition de la couche forestière par essences plantées

abattoir
type: Class
subclass of: installation d élevage
alternative label: slaughter-house @en

abreuvoir
type: Class
subclass of: équipement agricole
comment: Point d eau où les animaux peuvent boire
preferred label: watering-trough @en

abri
type: Class
subclass of: hébergement isolé
comment: Construction rudimentaire permettant de se mettre à l abri du mauvais temps, du soleil, d un certain danger, etc.
alternative label: bivouac
preferred label: shelter @en

rupture naturelle de relief concave
type: Class
subclass of: dépression ouverte
comment: Contient des formes de relief qui résultent d un phénomène naturel d érosion ( eau, vent, etc.) et regroupe les formes de relief selon si elles sont ponctuellement localisées ou effilées
preferred label: concave natural relief break @en

agglomération
type: Class
subclass of: zone d habitation
alternative label: agglomeration @en
alternative label: bourg
alternative label: bourgade @en
alternative label: chef-lieu
alternative label: community @en
alternative label: conurbation @en
alternative label: localité
alternative label: station thermale
alternative label: thermal station
alternative label: winter sport resort @en
preferred label: urban area @en

aiguille
type: Class
subclass of: sommet de forme pointue
comment: Montagne de forme effilée
comment: Montagne dont le sommet a une forme de dent
alternative label: spine @en
alternative label: stack @en

aire de pique-nique
type: Class
subclass of: infrastructure sport et loisirs
comment: Lieu en nature doté d une table permettant de pique-niquer
preferred label: picnic site @en

aire de péage
type: Class
subclass of: infrastructure de transport routier
comment: Structure aménagée au sein d une autoroute pour s acquiter de la taxe perçue au passage de l autoroute
alternative label: toll @en
alternative label: toll booths @en
alternative label: toll-house @en
preferred label: toll-gate @en

amer
type: Class
subclass of: infrastructure de déplacement maritime ou fluvial
alternative label: beacon @en
alternative label: bouée
alternative label: buoy @en
alternative label: feu
alternative label: lighthouse @en
alternative label: phare
alternative label: sea-mark @en
alternative label: tourelle
preferred label: seamark @en

amphitéatre
type: Class
subclass of: bâtiment remarquable
comment: Lieu en plein air où peuvent avoir lieux différentes representations (théatre, musique, etc) public.
alternative label: amphitheater @en
alternative label: arena @en
alternative label: arène
alternative label: open-air theater @en
alternative label: roman theater @en
alternative label: theater in the round @en
alternative label: théatre antique
alternative label: théâtre de plein air
alternative label: téhatre roamin
preferred label: outdoor theater @en

anneau de glace
type: Class
subclass of: patinoire
preferred label: ice ring @en

antenne
type: Class
subclass of: infrastructure téléphonie mobile
alternative label: aerial @en
alternative label: dish @en
alternative label: relais
preferred label: antenna @en

antenne GSM
type: Class
subclass of: antenne
preferred label: GSM antenna @en

aqueduc
type: Class
subclass of: infrastructure de transport d eau
comment: Chenal artificiel conçu pour le transport de l eau (usage hydroéléctique, industriel,...)
preferred label: aqueduct @en

arbre
type: Class
subclass of: végétation arborée
preferred label: tree @en

arcade
type: Class
subclass of: monument
comment: Ouverture faite d un arc portant sur des piédroits, des piliers ou des colonnes
alternative label: arc de triomphe
alternative label: arch @en

arcosse
type: Class
subclass of: lande
comment: Arbuste montagnard. Connu par sa souplesse : en hiver le skieur peut passer dessus; Au printemps peut provoquer des avalanches
alternative label: alnus viridis @en
alternative label: aulne vert
preferred label: arcos @en

arrondissement
type: Class
subclass of: division territoriale administrative
preferred label: district @en

arête
type: Class
subclass of: élément dejonction de plans éfillé
comment: forme en crête entre deux sommets
preferred label: edge @en

autoroute
type: Class
subclass of: infrastructure de transport routier
alternative label: bretelle
alternative label: voie rapide

auvent
type: Class
subclass of: équipement de protection du réseau routier
alternative label: protective scaffold @en
preferred label: awning @en

aven
type: Class
subclass of: gouffre
alternative label: embùt
preferred label: sink hole @en

aérogare
type: Class
subclass of: infrastructure de déplacement aérien
alternative label: air terminal @en

aéroport
type: Class
subclass of: infrastructure de déplacement aérien
preferred label: airport @en

bac
type: Class
subclass of: franchissement
comment: Itinéraire de transport maritime de passagers ou de véhicules permettant la traversée d un fleuve.
preferred label: ferry

balcon
type: Class
subclass of: plateau adouci de forme compacte
comment: Plate-forme naturelle offrant un point de vue sur un paysage situé en contrebas.
preferred label: balcony @en

balisage
type: Class
subclass of: construction
comment: Marque concrète ponctuelle d un itinéraire, d une frontière ou d un point d altitude
preferred label: beaconing @en

balise
type: Class
subclass of: balisage
comment: Element situé au long d un linéaire (piste de ski, piste de VTT) et permet de se localiser. Il renseigne en général sur la difficulté et la distance qui reste à parcourir.
preferred label: tag @en

banc
type: Class
subclass of: infrastructure sport et loisirs
comment: Lieu où les gens peuvent s’asseoir ; généralement à plusieurs.
preferred label: bench @en

banc de sable
type: Class
subclass of: transition terre
comment: Accumulation de sable, dans la mer ou dans un cours d eau, qui affleure à la surface de l eau.
alternative label: tidal flat @en
preferred label: sandbank @en

barrage
type: Class
subclass of: équipement de protection hydrographique
is defined by: Ouvrage construit pour empêcher ou limiter un mouvement quelconque ; en particulier, ouvrage construit pour retenir les eaux soit en vue de leur utilisation pour la production d énergie électrique, l irrigation des cultures ou l alimentation des collectivités (barrage-réservoir), soit simplement en vue d en régulariser l écoulement (barrage de retenue ou de régulation); http://id.eaufrance.fr/nsa/831
alternative label: retenue-barrage
alternative label: weir @en
preferred label: dam @en

barre rocheuse
type: Class
subclass of: pente abrupte
comment: Paroi un à-pic sur une certaine longueur d une montagne
comment: rempart montagneux
alternative label: barre
alternative label: rempart
alternative label: rocky cliff @en
preferred label: rocky hog back @en

barrière
type: Class
subclass of: limite matérialisée
comment: Construction qui fait office de barrière pour fermer un passage
alternative label: gate @en
preferred label: barrier @en

base nautique
type: Class
subclass of: équipement sportif
alternative label: marina @en
alternative label: port de plaisance
preferred label: water area @en

bergerie
type: Class
subclass of: hébergement isolé
comment: La bergerie est le bâtiment, et éventuellement l enclos réservé à l élevage des ovins
preferred label: sheepfold @en

bief
type: Class
subclass of: cours d eau artificiel
alternative label: level @en
alternative label: reach @en
preferred label: bay @en

bloc rocheux isolé
type: Class
subclass of: rupture de relief convexe issu d éboulement
alternative label: caillou
preferred label: isolated rock @en

blockhaus
type: Class
subclass of: bâtiment militaire
alternative label: bunker @en
alternative label: casemate
alternative label: pillbox @en
preferred label: blockhouse @en

borne
type: Class
subclass of: balisage
comment: Lieu géographique matérialisant à travers un bloc de pierre, un poteau une plaque, etc. et indique une information (frontière, altitude, etc.).
preferred label: marker @en

borne frontière
type: Class
subclass of: borne
comment: Borne indiquant une frontière entre deux pays, deux départements, deux propriétés, etc.
alternative label: boundary beacon @en
alternative label: boundary monument @en
alternative label: boundary stone @en
preferred label: boundary marker @en

borne géodésique
type: Class
subclass of: borne
comment: Un point matérialisé dont les coordonnées sont connues avec précision
preferred label: geodetic point @en

borne kilométrique
type: Class
subclass of: borne
comment: Borne indiquant les distances en kilomètres
preferred label: odometer @en

borne militaire
type: Class
subclass of: borne
comment: Borne indiquant les limites des terrains militaires
preferred label: military milestone @en

broussaille
type: Class
subclass of: végétation basse
alternative label: garrigue @en
alternative label: maquis
preferred label: scrub growth @en

brèche
type: Class
subclass of: selle
comment: Dépression dans une chaîne de montagne ou une crête rocheuse souvent utilisée comme passage
preferred label: breach @en

bureau de guides
type: Class
subclass of: bâtiment d information
comment: Bâtiment où se trouve des guides de montagne
preferred label: guide office @en

bureau de poste
type: Class
subclass of: bâtiment administratif
comment: Bâtiment à usage administratif où s exerce le service du courrier
preferred label: post office @en

bâtiment administratif
type: Class
subclass of: bâtiment et installation
comment: Bâtiment ayant un usage administratif
preferred label: administrative building @en

bâtiment commercial
type: Class
subclass of: bâtiment et installation
comment: Bâtiment ayant un usage commercial
preferred label: commercial building @en

bâtiment culturel
type: Class
subclass of: bâtiment et installation
comment: Bâtiment ayant un usage culturel
preferred label: cultural building @en

bâtiment et installation
type: Class
subclass of: construction
comment: Construction constituant un lieu protecteur pour des personnes, des animaux ou des choses et les éléments associés tout en restant dans un espace circonscrit ainsi que les édifices
preferred label: building and installation @en

bâtiment et installation agricole
type: Class
subclass of: bâtiment et installation
comment: Bâtiment ou installation ayant un usage (principal) agricole
preferred label: farm building @en

bâtiment et installation industrielle
type: Class
subclass of: bâtiment et installation
comment: Bâtiment ou installation ayant un usage (principal) industriel
preferred label: industrial feature @en

bâtiment militaire
type: Class
subclass of: bâtiment et installation
comment: Bâtiment ayant un usage militaire
preferred label: military feature @en

bâtiment religieux
type: Class
subclass of: bâtiment et installation
comment: Bâtiment ayant un usage religieux
preferred label: christian religious @en

bâtiment remarquable
type: Class
subclass of: bâtiment et installation
subclass of: élément du patrimoine
comment: Un type de construction qui se remarque par son caractère patrimonial.
preferred label: touristic building @en

cabane
type: Class
subclass of: hébergement isolé
comment: Petite construction rudimentaire servant à abriter les hommes, les animaux ou les matériaux. La construction peut être temporaire.
alternative label: baraque
alternative label: hut @en
alternative label: hutte @en
preferred label: cabana @en

cairn
type: Class
subclass of: balisage
comment: Tumulus en pierre

calvaire
type: Class
subclass of: monument religieux
comment: Monument religieux composé, autour du Christ en croix, d un plus ou moins grand nombre de personnages et doté d un décor évoquant la scène de la crucifixion.
alternative label: summit cross @en
preferred label: calvary @en

camp militaire
type: Class
subclass of: zone militaire
preferred label: military camp @en

campanile
type: Class
subclass of: monument religieux
comment: Tour qui abrite des cloches ayant le rôle principal d appeler les fidèles à la prière. Le campanile est généralement une construction à part entière et peut se situer loin d un lieu de culte. Cet aspect le différentie d un clocher.

camping
type: Class
subclass of: hébergement accessible
comment: Emplacement aménagé pour la pratique du camping
alternative label: bungalow @en
alternative label: camp
alternative label: camping grounds @en
alternative label: camping site @en
alternative label: caravaning
alternative label: tent @en
alternative label: tente
alternative label: terrain de camping
preferred label: campsite @en

canal
type: Class
subclass of: cours d eau artificiel
comment: Voie d eau artificielle à surface libre
alternative label: channel @en

canal de navigation
type: Class
subclass of: infrastructure de déplacement maritime ou fluvial
preferred label: navigation canal @en

canalisation
type: Class
subclass of: infrastructure de transport d eau
alternative label: galerie d amenée d eau
alternative label: main @en
alternative label: pipe @en
preferred label: conduit @en

canton
type: Class
subclass of: division territoriale administrative

canyon
type: Class
subclass of: cours d eau
comment: Une portion de rivière permettant la descente de canyons ou la randonnée nautique

carrefour
type: Class
subclass of: infrastructure de transport routier
comment: Noeud d interséctions de plsuieures voies de communication routière
alternative label: embranchement
alternative label: intersection
alternative label: junction @en
preferred label: crossroads @en

cascade
type: Class
subclass of: cours d eau
comment: Site où l eau dévalet un relief vertical pour provoquer une cascade. Une chute d eau.
alternative label: chute d eau
alternative label: salto
alternative label: saut
preferred label: waterfall @en

caserne
type: Class
subclass of: bâtiment militaire
alternative label: barraquement
preferred label: barracks @en

caserne de pompiers
type: Class
subclass of: bâtiment administratif
comment: Bâtiment à usage administratif servant à loger les pompiers et le matériel nécessaire à la lutte contre l incendie
alternative label: SAMU
alternative label: firehouse @en
preferred label: fire station @en

catex
type: Class
subclass of: équipement de montagne

cathédrale
type: Class
subclass of: lieu de culte
preferred label: cathedral @en

caverne
type: Class
subclass of: grotte
comment: Cavité naturelle souterraine, fermée de tous côtés à l exception d une étroite ouverture et creusée dans une roche le plus souvent calcaire
alternative label: abime
preferred label: cavern @en

cavité
type: Class
subclass of: dépression fermée
comment: Espace creux, naturel ou artificiel, plus ou moins large et plus ou moins profond, fermé ou non, dans un corps solide
alternative label: anfractuosité
alternative label: creux
alternative label: excavation @en
alternative label: galerie
alternative label: hole @en
alternative label: trou
preferred label: cavity @en

centrale électrique
type: Class
subclass of: bâtiment et installation industrielle
alternative label: centrale hydro-electrique
alternative label: centrale nucléaire
alternative label: centrale thermique
alternative label: electrical power plant @en
alternative label: hydro-electric power plant @en
alternative label: nuclear power plant @en
alternative label: thermal power plant @en
preferred label: power station @en

centre SAMU
type: Class
subclass of: bâtiment administratif
comment: Centre SAMU qui coordonne et régule l’utilisation des secours d’urgence.
preferred label: SAMU center @en

centre de soin
type: Class
subclass of: établissement de santé
alternative label: hospice
alternative label: maison de repos
alternative label: maison de retraite
alternative label: maison médicale
alternative label: senior center @en
alternative label: spa @en
alternative label: treatment center @en
alternative label: établissement thermal
preferred label: healthcare center @en

centre historique
type: Class
subclass of: division territoriale administrative
preferred label: old center @en

centre ville
type: Class
subclass of: quartier
alternative label: centre
preferred label: town center @en

centre équestre
type: Class
subclass of: équipement sport de nature
comment: Un établissement contenant un équipement ayant pour vocation la pratique de l équitation
preferred label: equestrian centre @en

champ
type: Class
subclass of: plantation
subclass of: végétation basse
preferred label: field @en

champ de tir
type: Class
subclass of: zone militaire
alternative label: rifle range @en
preferred label: artillery range @en

chaos
type: Class
subclass of: rupture de relief convexe issu d érosion
comment: entassement de rochers dégagés par l érosion
alternative label: rockslide @en
alternative label: scree @en

chapelle
type: Class
subclass of: église
alternative label: oratoire
alternative label: oratorio @en
preferred label: chapel @en

chaîne de montagnes
type: Class
subclass of: ensembles montagneux
comment: allignement de montagne
preferred label: range of mountains @en

chemin
type: Class
subclass of: infrastructure de transport routier
subclass of: voie de communication non carrossable
comment: Element du réseau routier prévu pour la circulation de véhicules ou d’engins d’exploitation. Un chemin peut être carrossables ou non carrosables.
alternative label: allée forestière
alternative label: chemin d exploitation
alternative label: chemin de débardage
alternative label: chemin de halage
alternative label: forest road @en
alternative label: laie forestière
alternative label: ride @en
alternative label: skidding path @en
alternative label: track @en
preferred label: bridleway @en

cheminée
type: Class
subclass of: équipement industriel
alternative label: factory chimney @en
alternative label: flare @en
alternative label: flare tower @en
alternative label: smokestack @en
alternative label: torchère
preferred label: chimneystack @en

cheminée de fée
type: Class
subclass of: rupture de relief convexe issu d érosion
preferred label: fairy chimney @en

chourum
type: Class
subclass of: rupture naturelle de relief concave non-linéaire
comment: Cavité naturelle créusée par le vent et la pluie, où la neige peut s accumuler

château
type: Class
subclass of: bâtiment remarquable
comment: Lieu-dit caractérisé par la présence d un château.
alternative label: calstel
alternative label: château fort
alternative label: fortified castel @en
preferred label: castle @en

chèvrerie
type: Class
subclass of: hébergement isolé
comment: La bergerie est le bâtiment, et éventuellement l enclos réservé à l élevage des chèvres
preferred label: goat farm @en

cimetière
type: Class
subclass of: zonage
comment: Zone où l on enterre les morts.
alternative label: burial-ground @en
alternative label: funérarium
alternative label: graveyard @en
alternative label: nécropole
alternative label: ossuaire
alternative label: tombe
alternative label: tombeau
preferred label: cemetery @en

circuit automobile
type: Class
subclass of: piste de sport
alternative label: autodrome @en
alternative label: circuit auto-moto
preferred label: automobile-race track @en

cirque
type: Class
subclass of: dépression ouverte
comment: Enceinte naturelle à parois abrutes de forme plus ou moins circulaire creusée dans les flancs d un massif montagneux
alternative label: corrie @en

citerne
type: Class
subclass of: infrastructure de gestion d eau douce
comment: Réservoir d eau alimenté par de l eau de pluie. A se différentier du réservoir qui est réservoir est alimenté par un réseau
alternative label: cistern @en
preferred label: tank @en

clairière
type: Class
subclass of: ouverture dans la végétation
alternative label: meadow @en
preferred label: glade @en

clocher
type: Class
subclass of: monument religieux
comment: Monument élevée au-dessus ou dans le voisinage d une église, pour soutenir et abriter les cloches
alternative label: bell-tower @en
preferred label: steeple @en

cluse
type: Class
subclass of: passage encaissé aux parois abrupte
comment: Passage étroit et escarpé, creusé perpendiculairement à une ligne montagneuse et qui fait communiquer deux vallées
alternative label: clue
alternative label: cross-valley @en
alternative label: transverse valley @en

clôture
type: Class
subclass of: limite matérialisée
comment: Construction qui ferme l accès à un lieu
alternative label: fence @en
preferred label: enclosure @en

col
type: Class
subclass of: selle
comment: Dépression entre deux espaces élevés présentant une morphologie en forme de selle
alternative label: collet
alternative label: forclaz
alternative label: hourquette
alternative label: passage
alternative label: port
preferred label: mountain pass @en

colline
type: Class
subclass of: sommet de forme arrondie
comment: Relief de faible hauteur dont la pente est généralement douce
preferred label: hill @en

collège
type: Class
subclass of: établissement d enseignement
alternative label: middle school @en
alternative label: school @en
preferred label: junior high school @en

combe
type: Class
subclass of: passage encaissé aux parois peu abrupte
comment: Petite vallée encaissée
alternative label: anticlinal valley @en
alternative label: coomb @en
preferred label: comb @en

communauté de communes
type: Class
subclass of: division territoriale administrative
preferred label: community of communes @en

commune
type: Class
subclass of: division territoriale administrative
alternative label: locality @en

complexe sportif
type: Class
subclass of: équipement sportif
alternative label: gradin
alternative label: sports ground @en
alternative label: stade
alternative label: stadium @en
alternative label: tribune
preferred label: sports complex @en

concave
type: Class
subclass of: relief
comment: Contient des formes de relief concaves

conduit buse
type: Class
subclass of: infrastructure de transport d eau
comment: Ouvrage constitué d au moins un conduit transversal, généralement fait de béton ou de métal, laissant circuler l eau sous une route, une voie ferrée ou une autre structure
preferred label: nozzle line @en

conduit forcé
type: Class
subclass of: infrastructure de transport d eau
comment: Tuyau artificiel conçu pour le transport de l eau (usage hydroéléctique, industriel,...)
preferred label: forced pipe @en

conduite hydrocarbure
type: Class
subclass of: infrastructure hydrocarbure
alternative label: gazoduc
alternative label: oléoduc
alternative label: raw material pipeline @en

construction
type: Class
subclass of: objet de repère
comment: Contient toutes les constructions humaines dont la fonction apparente ne permet pas le rattachement aux classes hydrographie, végétation et relief

contrefort
type: Class
subclass of: chaîne de montagnes
comment: Petite chaîne de montagne longeant une chaîne principale; Peut aussi designer la bordure d une montagne résultant d une érosion d une montagne
alternative label: mountainside @en
preferred label: foothill @en

convexe
type: Class
subclass of: relief
comment: Contient des formes de relief convexe
alternative label: rise in the ground @en
alternative label: élévation
preferred label: convex @en

coopérative
type: Class
subclass of: installation de culture
subclass of: installation d élevage
preferred label: co-operative stores @en

coteau
type: Class
subclass of: versant
comment: Versant d une petite colline
alternative label: hill-side @en
alternative label: côte

couloir
type: Class
subclass of: passage encaissé aux parois peu abrupte
comment: Une partie creuse dans une paroie, neige, etc. qui peut servir de voie d accès
preferred label: corridor @en

coulée de lave
type: Class
subclass of: minérale
comment: Formation volcanique constituée d un épanchement de lave issue d un volcan
preferred label: lava flow @en

court de tennis
type: Class
subclass of: terrain de sport
alternative label: terrain de tennis
preferred label: tennis court @en

couvent
type: Class
subclass of: bâtiment religieux
alternative label: abbaye
alternative label: monastery @en
alternative label: monastère
alternative label: prieuré
preferred label: convent @en

couverture
type: Class
subclass of: objet de repère
comment: Contient les éléments végétaux et minéraux qui couvrent le sol et qui sont pertinents pour le secours en montagne
preferred label: cover @en

minérale
type: Class
subclass of: couverture
comment: Contient les éléments d origine minérale et qui peuvent être identifiables par rapports aux autres éléments de leurs environnements à savoir la végétation
preferred label: mineral @en

végétale
type: Class
subclass of: couverture
comment: Contient la végétation, qu elle soit "naturelle" ou artificialisée
preferred label: vegetation @en

cratère
type: Class
subclass of: rupture naturelle de relief concave non-linéaire
comment: Évasement de la cheminée, en forme d entonnoir, au sommet ou sur les flancs d un cône volcanique
preferred label: crater @en

cressonnière
type: Class
subclass of: plantation
subclass of: végétation basse
alternative label: watercress pond @en
preferred label: watercress bed @en

crevasse
type: Class
subclass of: rupture glacière
comment: Fentes profondes sillonnant les glaciers et provoquées par la rupture de la glace en mouvement

croix
type: Class
subclass of: monument religieux
comment: Symbole chrétien. En zone de montagne la croix est utilisée pour marquer le sommet d une montagne.
alternative label: croix de chemin
alternative label: wayside cross @en
preferred label: cross @en

croupe
type: Class
subclass of: élément dejonction de plans doux
comment: Partie supérieure, arrondie, d une élévation de terrain
preferred label: croup @en

crèche
type: Class
subclass of: établissement d enseignement
preferred label: nursery @en

crête
type: Class
subclass of: élément dejonction de plans éfillé
comment: Ligne de points haut d un relief séparant deux versants opposés
alternative label: ligne de crête
alternative label: ridge @en
preferred label: crest @en

cuvette
type: Class
subclass of: dépression fermée
comment: Creux topographique, occupé actuellement par les eaux (à titre permanent ou saisonnier) ou anciennement occupé par les eaux et conservant les dépôts accumulés en milieu océanique, marin ou lacustre. Par extension, toute forme qui se prête à la constitution d un bassin fermé
preferred label: depression @en

cynodrome
type: Class
subclass of: piste de sport
preferred label: dog race track @en

câble transporteur
type: Class
subclass of: infrastructure de transport par câble
comment: Infrastructure de transport constitué d un ou de plusieurs câbles porteurs, servant à assurer le transport de matériel ou de matériaux.
alternative label: telpher line @en
alternative label: telpher railway @en
preferred label: cableway @en

cénote
type: Class
subclass of: doline
comment: Le cénote est une doline effondrée, en milieu karstique, totalement ou partiellement remplis d eau.
preferred label: cenote @en

dalle de protection
type: Class
subclass of: équipement de protection du réseau routier
preferred label: protective wall @en

dalle rocheuse
type: Class
subclass of: pente abrupte
comment: c est une exception de la déf de vertical et horizontal

décrochement le long d un axe
type: Class
subclass of: verticale
comment: Regroupe des éléments ayant une pente abrupte et qui sont reliés à la notion du réseaux routier; ce sont des éléments dangereux pour les activités en montagne notamment sur sentier.
preferred label: offset along an axis @en

dent
type: Class
subclass of: sommet de forme pointue
preferred label: top land @en

diffluence
type: Class
subclass of: noeud hydrographique
comment: Point où un cours d eau ou un glacier se divise en plusieurs bras qui ne se rejoignent pas

digue
type: Class
subclass of: équipement de protection hydrographique
is defined by: La digue est un ouvrage linéaire, généralement de grande longueur, longitudinal par rapport au sens de l écoulement de l eau, surélevé par rapport au terrain naturel et destiné à s’opposer au passage de l’eau ou à la canaliser; http://id.eaufrance.fr/nsa/831
alternative label: breakwater @en
alternative label: dike @en
alternative label: estacade
alternative label: levee @en
preferred label: embankment @en

division territoriale administrative
type: Class
subclass of: zonage
comment: Délimitation légale du territoire a but administratif
preferred label: administrative subdivision @en

doline
type: Class
subclass of: rupture naturelle de relief concave non-linéaire
comment: Excavation circulaire fermée de nature karstique, à fond plus ou moins plat, pouvant avoir de dix à plusieurs centaines de mètres de diamètre
alternative label: sink hole @en
alternative label: swallow-hole @en

dolmen
type: Class
subclass of: vestige
comment: Monument mégalithique fait de pierres brutes agencées en forme de table gigantesque
alternative label: cromlech @en

élément dejonction de plans doux
type: Class
subclass of: élément de jonction de plans
comment: Regroupe des éléments de plans de montagne qui se retrouve en quelques sorte à l intersection des plans. Ce lieu d intersection a une forme douce (douceur de pente).
preferred label: element of gentle plane junction @en

drop zone
type: Class
subclass of: installation de secours
comment: Zone d attérissage pour l hélicoptère
alternative label: DZ

défilé
type: Class
subclass of: gorge
comment: Passage naturel, étroit et encaissé, qu on ne peut traverser qu en file
preferred label: steep-sided gorge @en

départ de ski de fond
type: Class
subclass of: équipement sport de nature
comment: Départ de ski de fond: bâtiment servant d’animation et de vente des forfaits au départ des pistes de ski de fond. (spéc de la bdtopo)
preferred label: departure of ski de fond @en

département
type: Class
subclass of: division territoriale administrative
preferred label: department @en

dépression fermée
type: Class
subclass of: concave
comment: Contient des formes de relief concaves gardant l eau
preferred label: closed depression @en

dépression ouverte
type: Class
subclass of: concave
comment: Contient des formes de relief concave qui ne peuvent pas garder l eau; l eau coule
preferred label: open depression @en

déversoir
type: Class
subclass of: équipement de protection hydrographique
preferred label: spillway @en

enceinte
type: Class
subclass of: limite matérialisée
preferred label: surrounding wall @en

ensembles montagneux
type: Class
subclass of: convexe
comment: Regroupe les ensembles montagneux et désigne des termes généreaux des éléments de la montagne
preferred label: mountainous regions

entonnoir de dissolution
type: Class
subclass of: doline
comment: Dépréssion en forme d"entonnoir formée par la dissolution d une zone montagneuse, souvent sur un versant. La roche qui affleure, dans les lieux où il n y a pas de couvert végétal est constituée de gypse.
preferred label: funnel dissolution @en

entrepôt
type: Class
subclass of: équipement industriel
alternative label: depot @en
alternative label: stockyard @en
alternative label: storage area @en
preferred label: warehouse @en

escalier
type: Class
subclass of: voie de communication non carrossable
comment: Construction à l utilisation des piétons, constituée d une suite régulière de marches reliant deux lieux d altitudes différentes.
alternative label: steps @en
preferred label: stairs @en

escarpement
type: Class
subclass of: rupture de pente
comment: Pente raide, abrupte
alternative label: scarp @en
preferred label: escarpment @en

exploitation maraîchère
type: Class
subclass of: installation de culture
preferred label: market gardening @en

exutoire
type: Class
subclass of: noeud hydrographique
comment: Noeud de fin d une série de portions du réseau hydrographique interconnectés.
preferred label: outlet @en

face
type: Class
subclass of: pente
comment: la face d un relief ayant les mêmes caractéristiques (rocheux, neige)

faille
type: Class
subclass of: rupture rocheuse
comment: Fissure, cassure dans une couche géologique
preferred label: fault @en

falaise
type: Class
subclass of: pente abrupte
comment: Escarpement abrupt
comment: Paroi à très forte pente, exempte de végétation, marquant le contact entre la mer et la terre
preferred label: cliff @en

fenêtre
type: Class
subclass of: col
comment: petit col; découpage; forme souvent rectangulaire

ferme
type: Class
subclass of: installation de culture
subclass of: installation d élevage
alternative label: exploitation agricole
preferred label: farm @en

fissure
type: Class
subclass of: rupture rocheuse
comment: Fente rocheuse qui ne permet pas le passage d un corps mais sert de prise ou de points d assurage
alternative label: lézarde
preferred label: crack @en

flanc
type: Class
subclass of: pente
comment: Chacune des parties qui plongent de part et d autre d un plan axial
alternative label: face de racordement

fleuve
type: Class
subclass of: cours d eau
comment: Cours d eau important, généralement caractérisé par une très grande longueur et largeur, un débit abondant, des affluents nombreux, et qui se jette le plus souvent dans la mer
preferred label: major river @en

fond de vallée
type: Class
subclass of: grande étendue plate
alternative label: designe la partie plate de la vallée
preferred label: valley bottom @en

fontaine
type: Class
subclass of: infrastructure de gestion d eau douce
comment: Construction comportant une alimentation en eau et, généralement, un bassin
preferred label: fountain @en

fort
type: Class
subclass of: bâtiment militaire
subclass of: hébergement isolé
comment: Un bâtiment d origine militaire
alternative label: bastille
alternative label: citadelle
alternative label: forteresse
alternative label: fortification

forêt
type: Class
subclass of: massif boisé
alternative label: forêt fermée mixte
alternative label: forêt ouverte
preferred label: wood @en

forêt de feuillus
type: Class
subclass of: forêt
subclass of: Restriction
  on property: type de composition du peuplement
  has value: Feuillus
alternative label: forêt fermée de feuillus

forêt de résineux
type: Class
subclass of: forêt
subclass of: Restriction
  on property: type de composition du peuplement
  has value: Résineux
alternative label: forêt de conifères
alternative label: forêt fermée de conifères
alternative label: forêt fermée de résineux

forêt domaniale
type: Class
subclass of: zone naturelle protégée
preferred label: national forest @en

forêt mixtes
type: Class
subclass of: forêt
subclass of: Restriction
  on property: type de composition du peuplement
  has value: Mixtes
comment: Massif boisé dont la composition forestière est mixte: feuillus et résineux
alternative label: forêt fermée mixte

fossé
type: Class
subclass of: décrochement le long d un axe
comment: Petite pente abrupte sous un axe (route, chemin, sentier)
alternative label: biaou
alternative label: gutter @en
alternative label: moat @en
alternative label: rigole
alternative label: trench @en
alternative label: watergang
preferred label: ditch @en

franchissement
type: Class
subclass of: infrastructure de transport routier
subclass of: voie de communication non carrossable
comment: Element permettant de franchir ou de traverser un objet qui peut être vu comme obstacle
preferred label: bridge @en

fronton de pelote basque
type: Class
subclass of: terrain de sport
preferred label: pelota play wall @en

garage individuel
type: Class
subclass of: bâtiment et installation
comment: Batiment relié à une maison d habitation et conçu pour le stationnement des véhicules
alternative label: box @en
alternative label: garage @en
preferred label: individual garage @en

gare
type: Class
subclass of: infrastructure de transport par câble
comment: Terminaux permettant d ancrer les câbles porteurs d une remontée mécanique. Elle permet la montée ou la descente des personnes.
alternative label: telpher station @en
preferred label: cable car station @en

gare ferrovière
type: Class
subclass of: infrastructure de transport ferré
comment: Esemble des installations et des bâtiments nécessaires à l embarquement et au débarquement des voyageurs et des marchandises qui s y trouvent
alternative label: aire de garage
alternative label: aire de triage
alternative label: arrêt ferroviaire
alternative label: freight yard @en
alternative label: gare de fret
alternative label: gare voyageurs
alternative label: marshalling yard @en
alternative label: passengers station @en
alternative label: point de desserte
alternative label: station voyageurs
preferred label: station @en

gare funiculaire
type: Class
subclass of: gare ferrovière
alternative label: funicular station @en

gare routière
type: Class
subclass of: infrastructure de transport routier
comment: Une structure de correspondance entre plusieurs lignes de transports en commun voyageant par la route.
preferred label: bus station @en

gave
type: Class
subclass of: cours d eau

gazex
type: Class
subclass of: équipement de montagne
comment: déclancheur d avalanche

glacier
type: Class
subclass of: surface neige et glace
comment: Terrains couverts de neige en permanence (CNIG)

gorge
type: Class
subclass of: passage encaissé aux parois abrupte
comment: Vallée étroite et encaissée
alternative label: gleann @en
alternative label: glen @en

gouffre
type: Class
subclass of: cavité
comment: Cavité souterraine creusée par les eaux dans les régions calcaires
alternative label: abyss @en
alternative label: abîme
alternative label: chasm @en
alternative label: gulf @en
alternative label: précipice
preferred label: scialet @en

grande étendue plate
type: Class
subclass of: horizontale
comment: Regroupe des éléments ayant une forme plate
preferred label: large flat area @en

grange
type: Class
subclass of: équipement agricole
alternative label: hangar
preferred label: barn @en

grotte
type: Class
subclass of: cavité
comment: Caverne naturelle dans un rocher − quelquefois souterraine ou sous-marine −, ou qui est creusée de main d homme, et sert parfois de lieu d habitation
alternative label: antre
alternative label: cave
alternative label: grotto @en
preferred label: caverne @en

gué
type: Class
subclass of: franchissement
alternative label: radier
preferred label: ford @en

gymnase
type: Class
subclass of: équipement sportif
alternative label: salle de sport
preferred label: gymnasium @en

gîte
type: Class
subclass of: hébergement accessible
comment: Un type d hébergement (maison ou immeuble) meublé et équipé, mis entièrement à la disposition des visiteurs pendant une période contre une location de courte durée. Il n est pas possible de le louer à la nuitée
alternative label: country cottage @en
alternative label: gîte d étape
alternative label: gîte rural
alternative label: gîte touristique
alternative label: rest house @en
alternative label: touristic lodge @en
preferred label: lodge @en

habert
type: Class
subclass of: hébergement isolé
comment: Un habert est une maisonnette d alpage destinée initialement à l abri des bergers et qui peut aujourd hui accueillir des randonneurs

habitation troglodytique
type: Class
subclass of: bâtiment remarquable
comment: Habitats souterrains ou creusés dans le rocher à flanc de montagne
preferred label: cliff dwelling @en

haie
type: Class
subclass of: végétation arborée
subclass of: végétation basse
alternative label: hedge-row @en
alternative label: rangée d arbres
preferred label: hedge @en

hameau
type: Class
subclass of: zone d habitation
alternative label: local placename @en
alternative label: écart
preferred label: hamlet @en

hangar industriel
type: Class
subclass of: équipement industriel
preferred label: industrial hangar @en

hippodrome
type: Class
subclass of: piste de sport
alternative label: champ de courses équestres
alternative label: piste équestre
alternative label: racetrack @en
preferred label: racecourse @en

horizontale
type: Class
subclass of: planaire
comment: Regroupe des éléments du relief dont la forme tend vers l horizontalité
preferred label: horizontal @en

hydrographie
type: Class
subclass of: objet de repère
comment: Contient tous les éléments hydrographiques et les constructions dont la fonction apparente est liée à l hydrographie
preferred label: hydrographic feature @en

hébergement accessible
type: Class
subclass of: bâtiment d hébergement
comment: Un bâtiment ayant le rôle d héberger des visiteurs pendant une durée limitée. Il est facilement accessible via le réseau routier principal. Il n a pas de rôle de résidence secondaire ou principale
preferred label: accessible accomodation @en

hébergement isolé
type: Class
subclass of: bâtiment d hébergement
comment: Bâtiment ayant le rôle d habriter des personnes ou des animaux pour une durée courte. Il est accessible généralement via des sentiers et des chemin ou par voie aérienne. Il structure l espace de haute montagne; il peut servir à s abriter
preferred label: isolated accomodation @en

héliport
type: Class
subclass of: infrastructure de déplacement aérien
alternative label: heliport @en
preferred label: helicopter aerodrome @en

hôpital
type: Class
subclass of: établissement de santé
alternative label: clinic @en
alternative label: clinique
alternative label: dispensaire
alternative label: polyclinique
alternative label: établissement hospitalier
preferred label: hospital @en

hôtel
type: Class
subclass of: hébergement accessible
comment: Bâtiment ayant comme rôle l hébergement des personnes pour effectuer leurs activités touristiques ou de loisirs pendant une durée limitée
alternative label: auberge
alternative label: ferme-auberge
alternative label: hostel @en
alternative label: hôtel de montagne
alternative label: manor @en
alternative label: mountain hotel @en
preferred label: hotel @en

igue
type: Class
subclass of: gouffre
comment: Cavité étroite pouvant résulter d un effondrement d une cavité

immeuble collectif
type: Class
subclass of: bâtiment d habitation
comment: Un bâtiment à plusieurs étages destiné à assurer un usage d habitation. Il est divisé en différentes parties privatives (ex appartements) et communes. Ils possèdent un ou plusieurs propriétaires .
alternative label: immeuble d habitation
alternative label: residential building @en
preferred label: apartment building @en

infrastructure
type: Class
subclass of: construction
comment: Ensemble des équipements économiques ou techniques

infrastructure de déplacement aérien
type: Class
subclass of: infrastructure déplacement
comment: Infrastructure permettant le déplacement par la voie aérienne
preferred label: air transport infrastructure @en

infrastructure de déplacement maritime ou fluvial
type: Class
subclass of: infrastructure déplacement
preferred label: sea or river transport infrastructure @en

infrastructure de déplacement terrestre
type: Class
subclass of: infrastructure déplacement
comment: Infrastructure permettant le déplacement par la voie terrestre
preferred label: transport infrastructure on earth surface @en

infrastructure de traitement des eaux
type: Class
subclass of: infrastructure eau
preferred label: sewage treatment plant @en

infrastructure de transport ferré
type: Class
subclass of: infrastructure de déplacement terrestre
comment: Infrastructure permettant le déplacement par la voie ferrée
preferred label: transport by rail infrastructure @en

infrastructure de transport par câble
type: Class
subclass of: infrastructure de déplacement terrestre
comment: Infrastructure permettant le déplacement par câble
alternative label: cableway transport infrastructure @en
preferred label: cable car infrastructure @en

infrastructure de transport routier
type: Class
subclass of: infrastructure de déplacement terrestre
comment: Infrastructure routière permettant la circulation des véhicules motorisés.
preferred label: road transport infrastructure @en

infrastructure déplacement
type: Class
subclass of: infrastructure
preferred label: displacement infrastructure @en

infrastructure eau
type: Class
subclass of: infrastructure eau énergie
preferred label: water infrastructure @en

infrastructure eau énergie
type: Class
subclass of: infrastructure
preferred label: water energy communication infrastructure @en

infrastructure hydrocarbure
type: Class
subclass of: infrastructure eau énergie
preferred label: hydrocarbon infrastructure @en

infrastructure service
type: Class
subclass of: bâtiment et installation
comment: Regroupe les infrastructures de services ayant le rôle de protéction ou les équipements scientifiques et techniques
preferred label: service infrastructure @en

infrastructure sport et loisirs
type: Class
subclass of: bâtiment et installation
comment: Infrastructure permettant la réalisation d un sport ou d une activité de loisir
preferred label: sport and leisure infrastructure

infrastructure téléphonie mobile
type: Class
subclass of: infrastructure eau énergie
preferred label: wireless telephony infrastructure @en

infrastructure électricité
type: Class
subclass of: infrastructure eau énergie
preferred label: electricity transport infrastructure @en

installation de culture
type: Class
subclass of: bâtiment et installation agricole
preferred label: farmlands @en

installation de secours
type: Class
subclass of: bâtiment et installation
comment: Installation permettant le premier secours en montagne
preferred label: emergency facility @en

installation minière
type: Class
subclass of: bâtiment et installation industrielle
alternative label: ballast pit @en
alternative label: ballastière
alternative label: borrow pit @en
alternative label: carrière
alternative label: gravel pit @en
alternative label: gravière
preferred label: mine
alternative label: mineshaft @en
alternative label: quarry @en
alternative label: sablière
alternative label: sand pit @en

itinéraire balisé de raquette
type: Class
subclass of: équipement sport de nature
comment: Site équipé de balises définissant un itinéraire pour la pratique de la raquette
preferred label: snowshoes route @en

itinéraire balisé de ski de randonnée
type: Class
subclass of: équipement sport de nature
comment: Site équipé de balises définissant un itinéraire ayant comme vocation la pratique du ski de randonnée
preferred label: ski touring route @en

itinéraire balisé de trail
type: Class
subclass of: équipement sport de nature
comment: Site équipé de balises définissant un itinéraire ayant comme vocation la pratique du du trail
preferred label: trail route @en

jetée
type: Class
subclass of: équipement de protection hydrographique
alternative label: pier @en
preferred label: jetty @en

jonction
type: Class
subclass of: noeud hydrographique
comment: Un lieu où se rejoignent trois ou plusieurs cours d eau.
alternative label: confluence
alternative label: river confluence @en

karst
type: Class
subclass of: rupture de relief convexe issu d érosion
comment: région de formation calcaire caractérisée par la prépondérance du drainage souterrain et par le développement d une topographie originale due à la corrosion de la roche (grottes, gouffres, résurgences, etc.)

lac
type: Class
subclass of: plan d eau
comment: Masse d eau continentale accumulée naturellement et suffisamment profond
is defined by: Masse d eau continentale accumulée naturellement ; suffisamment profond, il comporte une stratification thermique stable. http://id.eaufrance.fr/nsa/831
alternative label: lac d altitude
preferred label: lake @en

lande
type: Class
subclass of: végétation basse
preferred label: heath @en

lapiaz
type: Class
subclass of: rupture de relief convexe issu d érosion
subclass of: rupture naturelle de relief concave non-linéaire
comment: point particulier (trou) présentant un risque pour la
alternative label: Surface de roche à nu, particulièrement érodée en sillons plus ou moins profonds, ou bien un point particulier donnant accès à des cavités profondes qui présentent des risques pour un randonneur
preferred label: limestone pavement; pas la bonne traduction @en

lavoir
type: Class
subclass of: bâtiment remarquable
comment: Construction comprenant un bassin alimenté en eau généralement d origine naturelle qui avait pour vocation première de permettre de laver le linge.
alternative label: washing place @en
preferred label: wash-house @en

levée de terre
type: Class
subclass of: équipement de protection hydrographique
alternative label: embankment @en
alternative label: levee @en
preferred label: earth bank @en

lieu-dit
type: Class
subclass of: zonage
preferred label: place name @en

lieu de culte
type: Class
subclass of: bâtiment religieux
alternative label: sanctuaire
preferred label: wayside shrine @en

ligne de faîte
type: Class
subclass of: élément dejonction de plans éfillé
comment: Enfilade de crêtes d une chaîne de montagnes.
alternative label: faîte
preferred label: ridge line @en

ligne électrique
type: Class
subclass of: infrastructure électricité
alternative label: power transmission line @en
preferred label: electricity transmission line @en

ligne électrique de basse tension
type: Class
subclass of: ligne électrique
preferred label: low power electricity transmission line @en

ligne électrique de haute tension
type: Class
subclass of: ligne électrique
preferred label: high power electricity transmission line @en

ligne électrique de moyenne tension
type: Class
subclass of: ligne électrique
preferred label: mean power electricity transmission line @en

ligne électrique de très haute tension
type: Class
subclass of: ligne électrique
preferred label: very high power electricity transmission line @en

limite matérialisée
type: Class
subclass of: construction
comment: Délimitations matérielles du territoire
preferred label: materialized border @en

lotissement
type: Class
subclass of: quartier
preferred label: estate @en

lycée
type: Class
subclass of: établissement d enseignement
alternative label: grammar-school @en
alternative label: secondary school @en
preferred label: high school @en

magasin
type: Class
subclass of: bâtiment commercial
alternative label: commerce
alternative label: garden center @en
alternative label: jardinerie
alternative label: supérette
preferred label: store @en

mairie
type: Class
subclass of: bâtiment administratif
comment: Bâtiment à usage administratif où s excerce des fonctions de maire et d administration municipale
alternative label: city hall @en
alternative label: hôtel de ville
preferred label: town-hall @en

maison
type: Class
subclass of: bâtiment d habitation
comment: Bâtiment ayant le rôle d hébergements de personnes. Il peut être destiné à des usages tels que résidentiel, touristique ou de loisirs.
alternative label: chalet @en
alternative label: chaumière
alternative label: demeure
alternative label: gentilhommière @en
alternative label: guesthouse @en
alternative label: maisonette
alternative label: manoir
preferred label: house @en

maison du parc
type: Class
subclass of: bâtiment culturel
subclass of: bâtiment d information
comment: A definir

maison forestière
type: Class
subclass of: installation de culture
preferred label: forest house @en

mamelon
type: Class
subclass of: sommet de forme arrondie
comment: Petite élévation de terrain au sommet arrondi
alternative label: rounded hillock @en
preferred label: knoll @en

marais
type: Class
subclass of: milieu humide
comment: Etendue d eau stagnante, peu profonde, et contenant de la végétation aquatique ou herbacée
alternative label: fen @en
preferred label: marsh @en

marché
type: Class
subclass of: bâtiment commercial
comment: Bâtiment ayant comme usage la commercialisation différents types de produits (alimentaires, habillement, etc.) le marché peut être couvert ou ouvert, temporaire ou permanent.
alternative label: covered market @en
alternative label: foire
alternative label: halle
alternative label: market house @en
alternative label: trade show @en
preferred label: market @en

mare
type: Class
subclass of: retenue
comment: un plan d eau peu profonde qui stagne
is defined by: Etendue d eau superficielle de petite taille et de faible profondeur, permanente ou saisonnière. Les mares de l estran abritent une flore et une faune d une grande variété et notamment des juvéniles de nombreuses espèces de poissons. Petite étendue d eau dormante, permanente ou temporaire, généralement de formation naturelle, plus petite qu un étang. http://id.eaufrance.fr/nsa/831
preferred label: pool @en

marquage
type: Class
subclass of: balisage
comment: Marque matérialisant les passages de l itinéraire
alternative label: marquage au sol
alternative label: marque
preferred label: marking @en

marécage
type: Class
subclass of: milieu humide
comment: Etendue d eau ayant un couvert arbustif sur une partie de sa superficie
preferred label: swamp @en

massif
type: Class
subclass of: ensembles montagneux
comment: Ensemble de montagnes formant un bloc continu
alternative label: massif de montagne
alternative label: mountain massif @en

massif boisé
type: Class
subclass of: végétation arborée
alternative label: bois
alternative label: bosquet
alternative label: clumps @en
alternative label: forest @en
alternative label: futaie
alternative label: grove @en
alternative label: taillis
preferred label: wooded area @en

menhir
type: Class
subclass of: vestige
comment: Monument mégalithique, pierre allongée dressée verticalement.
alternative label: Cromlech
alternative label: standing stone @en

milieu humide
type: Class
subclass of: hydrographie
is defined by: Un milieu humide est une portion du territoire, naturelle ou artificielle, caractérisée par la présence de l eau (Sandre : https://www.sandre.eaufrance.fr/)
preferred label: wetland @en

monument
type: Class
subclass of: élément du patrimoine
comment: Ouvrage d architecture, de sculpture, etc., destiné à perpétuer un souvenir.

monument aux morts
type: Class
subclass of: monument
comment: Monument érigé pour commémoer et honorer les soldats ou les personnes disparue à cause d une guerre
preferred label: war memorial @en

monument religieux
type: Class
subclass of: monument
comment: Monument de nature religieuse
preferred label: catholic or orthodox shrine @en

moraine
type: Class
subclass of: rupture de relief convexe issu d éboulement
comment: Accumulation de pierres, roches et éboulis sur le front et les bords d un glacier (et parfois à sa surface).
comment: Amas de blocs et de débris rocheux entraînés par le mouvement de glissement d un glacier

mosquée
type: Class
subclass of: lieu de culte
alternative label: minaret
preferred label: mosque @en

moulin
type: Class
subclass of: bâtiment remarquable
comment: Installation ancienne permettant de moudre les céreales comportant des ailes permettant de transformer l énergie du vent, de l eau, etc. en mouvement rotatif
alternative label: moulin à eau
alternative label: moulin à vent
alternative label: water-mill @en
alternative label: windmill @en
preferred label: mill @en

mur
type: Class
subclass of: limite matérialisée
comment: Construction qui fait office de séparation entre deux lieux
alternative label: wall @en

mur anti-bruit
type: Class
subclass of: équipement de protection
alternative label: sound attenuation barrier @en
alternative label: soundproof wall @en
preferred label: noise wall @en

mur de soutènement
type: Class
subclass of: équipement de protection
preferred label: retaining wall @en

musée
type: Class
subclass of: bâtiment culturel
alternative label: maison à thème
preferred label: museum @en

noeud hydrographique
type: Class
subclass of: hydrographie
comment: Point particulier situé sur le réseau hydrographique terrestre
preferred label: hydrographic node @en

névé
type: Class
subclass of: surface neige et glace
comment: Terrains couverts de neige en permanence (CNIG) @en
preferred label: firn @en

objet de repère
type: Class
equivalent class: Feature
preferred label: landmark @en

observatoire astronomique
type: Class
subclass of: équipement scientifique et technique
preferred label: observatory @en

observatoire de tir
type: Class
subclass of: bâtiment militaire
alternative label: rifle-range @en
preferred label: artillery range @en

observatoire à incendie
type: Class
subclass of: équipement de protection
alternative label: observation tower @en
preferred label: fire observatory @en

obélisque
type: Class
subclass of: monument
comment: Pierre levée à base quadrangulaire, taillée en forme de pyramide très élancée et terminée par une pointe pyramidale.
preferred label: obelisk @en

office de tourisme
type: Class
subclass of: bâtiment d information
comment: Bâtiment qui accueille du public et dont la principale mission est l information et la promotion du tourisme et des activités touristiques
alternative label: point d information touristique
alternative label: syndicat d initiative
alternative label: tourist information bureau @en
preferred label: tourist information office @en

ouverture dans la végétation
type: Class
subclass of: végétation arborée
preferred label: opening @en

palais de justice
type: Class
subclass of: bâtiment administratif
comment: Bâtiment à usage administratif où siège les cours et les tribunaux
alternative label: law-courts @en
alternative label: tribunal
preferred label: courthouse @en

panneau
type: Class
subclass of: balisage
comment: Un élément servant à baliser le reseau routier en indiquant des informations de direction, de distance, etc.
alternative label: pancarte
alternative label: panneau signalisation
preferred label: sign @en

parc
type: Class
subclass of: infrastructure sport et loisirs
comment: Lieu délimité, naturel ou semi-naturel doté d une infrastructure permettant les jeux, les promenades, etc.
alternative label: jardin public
alternative label: public square @en
alternative label: square
preferred label: park @en

parc aquatique
type: Class
subclass of: parc de loisir
comment: Infrastructure permettant la pratique de loisirs aquatiques
preferred label: water park @en

parc de loisir
type: Class
subclass of: infrastructure sport et loisirs
comment: Lieu délimité, équipé d une infrastructure permettant la pratique de loisirs
alternative label: parc de détente
preferred label: leisure park @en

parc national
type: Class
subclass of: zone naturelle protégée
preferred label: national park @en

parc naturel régional
type: Class
subclass of: zone naturelle protégée
alternative label: country park @en
preferred label: regional nature reserve @en

parc zoologique
type: Class
subclass of: parc de loisir
comment: Infrastructure qui permet de réunir de nombreuses espèces animales.
alternative label: aquarium @en
alternative label: zoo @en
alternative label: zoological garden @en
preferred label: zoological park @en

parcours acrobatique en hauteur
type: Class
subclass of: équipement sport de nature
comment: Les parcours acrobatiques en hauteur (PAH) sont des équipements installés durablement sur des arbres ou tout autre support naturel. Ils permettent d aller d un point à un autre à l aide de câbles. (réf : Service-Public.fr)
preferred label: acrobatic height course @en

pare-avalanche
type: Class
subclass of: équipement de montagne
alternative label: avalanche protection wall @en
preferred label: avalanche break @en

parking
type: Class
subclass of: infrastructure de transport routier
comment: Structure aménagée pour stationner les véhicules
alternative label: aire de stationnement
alternative label: parking lot @en
preferred label: car park @en

parking touristique isolé
type: Class
subclass of: parking
comment: Parc à voitures aménagé, servant de support à une activité touristique. Seuls les parkings isolés à proximité d un point d intérêt touristique sont sélectionnés.
preferred label: isolated car park @en

paroi rocheuse
type: Class
subclass of: pente abrupte
comment: Versant rocheux lisse et proche de la verticale
alternative label: muraille
alternative label: paroi
preferred label: rock wall @en

pas
type: Class
subclass of: col
comment: Passage étroit, souvent un passage technique ou plus délicat qu un col
alternative label: passe
preferred label: notch @en

passage encaissé
type: Class
subclass of: dépression ouverte
comment: Contient des éléments naturels qui se ressemblent en prennant en compte l extérieur des limites les définissant. Ces objets sont dominés par des éléments de pente peu abrupte (douce) ou abrupte;
preferred label: incised passage @en

passage encaissé aux parois abrupte
type: Class
subclass of: passage encaissé
comment: Contient des éléments naturels qui se ressemblent en en prennant en compte l extérieur des limites les définissant. Ces objets sont dominés par des éléments de pente abrupte ; contrairement au concept "passage encaissé aux parois peu abruptes" qui contient des éléments naturels dont la limite extérieure est de pente douce
preferred label: incised passage with steep wall @en

passage encaissé aux parois peu abrupte
type: Class
subclass of: passage encaissé
comment: Contient des éléments naturels qui se ressemblent en prennant en compte l extérieur des limites les définissant. Ces objets sont dominés par des éléments de pente peu abrupte (douce); contrairement au concept " passage encaissé aux parois abrupte" qui contient des éléments naturels dont la limite extérieure est raide.
preferred label: gently sloping-walled incised passage @en

passage à bétail
type: Class
subclass of: équipement agricole
preferred label: livestock passage @en

passerelle
type: Class
subclass of: pont
comment: Ouvrage d’art susceptible d’enjamber un ou plusieurs éléments du réseau routier
comment: Pont donnant passage aux seuls piétons
comment: passerelle

patinoire
type: Class
subclass of: équipement sportif
preferred label: skating rink @en

paturage
type: Class
subclass of: végétation basse
comment: Espace dédié à l alimentation des animaux
alternative label: alpage
alternative label: gazon
alternative label: grass @en
alternative label: herbage
alternative label: herbe
alternative label: pacage
alternative label: pature
alternative label: pré
preferred label: pasture @en

pays
type: Class
subclass of: division territoriale administrative
alternative label: state @en
alternative label: état
preferred label: country @en

pente
type: Class
subclass of: verticale
comment: Surface, terrain en pente Des éléments qui ne sont pas toujours vus comme de la très haute montagne
alternative label: déclivité
alternative label: rampe
preferred label: slope @en

pente abrupte
type: Class
subclass of: pente
comment: Regroupe les éléments de relief avec la notion de verticalité rocheuse
preferred label: steep slope @en

perte
type: Class
subclass of: noeud hydrographique
comment: Lieu où un cours d eau disparaît totalement ou partiellement par infiltration ou dans un gouffre
preferred label: loss @en

pic
type: Class
subclass of: sommet de forme pointue
comment: Sommet qui a la forme d une pointe
preferred label: peak @en

pierrier
type: Class
subclass of: rupture de relief convexe issu d éboulement
comment: Amoncellement de cailloux, de pierres; champ de pierres
alternative label: scree @en
alternative label: éboulis
preferred label: pile of stones @en

pigeonnier
type: Class
subclass of: bâtiment remarquable
comment: Petit bâtiment ou local aménagé pour le logement et l élevage des pigeons
alternative label: columbary @en
alternative label: dove-cot @en
alternative label: dove-cote @en
alternative label: pigeon-house @en
preferred label: columbarium @en

pilier
type: Class
subclass of: élément dejonction de plans éfillé
preferred label: pillar @en

piscine
type: Class
subclass of: équipement sportif
alternative label: swimming-bath @en
preferred label: swimming-pool @en

piste cyclable
type: Class
subclass of: voie de communication non carrossable
comment: Portion de la voirie aménagée pour la circulation des cycles non motorisés
preferred label: bicycle path @en

piste de VTT
type: Class
subclass of: équipement sport de nature
comment: Site équipé de balises définissant une piste ayant comme vocation la pratique du VTT
preferred label: mountain bike run @en

piste de cross
type: Class
subclass of: piste de sport
preferred label: cross-country track @en

piste de luge
type: Class
subclass of: équipement sport de nature
comment: Un site balisé ayant comme vocation la pratique de la luge
alternative label: bobsleigh track @en
alternative label: piste de bobsleigh
preferred label: luge track @en

piste de ski alpin
type: Class
subclass of: équipement sport de nature
comment: Site équipé de balises définissant une piste ayant comme vocation la pratique du ski alpin
alternative label: ski course @en
alternative label: ski trail @en
preferred label: alpine ski run @en

piste de ski nordique
type: Class
subclass of: équipement sport de nature
comment: Site équipé de balises définissant une piste ayant comme vocation la pratique du ski nordique
preferred label: nordic ski run @en

piste de sport
type: Class
subclass of: équipement sportif
alternative label: sports track @en
alternative label: track @en
preferred label: running track @en

piton
type: Class
subclass of: sommet de forme pointue
comment: Sommet pointu et dénudé d une montagne. Relief isolé de forme conique, monticule aigu difficile à escalader.
alternative label: pinnacle @en

place
type: Class
subclass of: infrastructure de transport routier
comment: Lieu public découvert entouré de constructions
preferred label: square @en

plage
type: Class
subclass of: transition terre
comment: Lieu plat et bas d un rivage destiné à la baignade
alternative label: gravel beach @en
alternative label: grève
preferred label: beach @en

plaine
type: Class
subclass of: grande étendue plate
comment: Grande étendue de terrain sans relief ou légèrement ondulée, d altitude peu élevée par rapport au niveau de la mer ou d altitude moindre que les régions environnantes.
preferred label: plain @en

plan d eau
type: Class
subclass of: hydrographie
comment: Une étendue d’eau continentale de surface, d origine naturelle ou anthropique, de profondeur variable
preferred label: water body @en

planaire
type: Class
subclass of: relief
comment: Formes de relief n ayant pas de courbures proéminentes définissant des formes (concaves, convexes, sous forme de selle à cheval). On différentie deux types de formes planaires : horizontales et verticales, en sachant que rarrement une forme est completement horizontale ou completement verticale, mais plutôt avec une tendance horizontale ou verticale.
preferred label: planary @en

plantation
type: Class
subclass of: végétale
comment: Espace dédié à une production agricole
alternative label: cultivated land @en
alternative label: farm land @en
alternative label: zone de culture
preferred label: crops @en

plateau
type: Class
subclass of: grande étendue plate
comment: Région plate située dans une altitude élevée
alternative label: table-land @en

plateau adouci
type: Class
subclass of: horizontale
comment: Éléments de relief planaires caractérisés par une pente douce et une altitude marquée. Ces surfaces sont essentiellement horizontales mais sont souvent associées à des éléments verticaux voisins, ce qui les relie conceptuellement aux structures de verticalité. Elles représentent des zones où le relief est adouci tout en conservant une élévation notable par rapport à l’environnement immédiat
preferred label: gently sloping plateau @en

pont
type: Class
subclass of: franchissement
comment: Ouvrage d’art susceptible d’enjamber un ou plusieurs éléments du réseau routier
alternative label: carrefour dénivelé
alternative label: culvert @en
alternative label: drawbridge @en
alternative label: ponceau
alternative label: pont mobile
alternative label: viaduc
alternative label: viaduct @en
preferred label: bridge @en

port
type: Class
subclass of: infrastructure de déplacement maritime ou fluvial
alternative label: harbour @en
alternative label: havre
preferred label: harbor @en

poste de gendarmerie
type: Class
subclass of: bâtiment administratif
comment: Bâtiment à usage administratif servant à loger les gendarmes et les activités liées aux missions de la gendermerie
preferred label: gendarmerie post @en

poste de police
type: Class
subclass of: bâtiment administratif
comment: Bâtiment à usage administratif servant à loger les policiers et les activités liées aux missions de la police
alternative label: commissariat
alternative label: customs @en
alternative label: police post @en
alternative label: poste de douane
preferred label: police station @en

poste de secours
type: Class
subclass of: installation de secours
comment: Point d alerte de premiers secours situé tout au long du parcours d une course, d une piste de ski, etc.
preferred label: first aid station @en

poste de transformation
type: Class
subclass of: infrastructure électricité
alternative label: poste électrique
alternative label: transformateur
preferred label: transformation sub-station @en

prairie
type: Class
subclass of: végétation basse
alternative label: gazon
alternative label: lawn @en
alternative label: pelouse
preferred label: meadow @en

prison
type: Class
subclass of: bâtiment administratif
comment: Bâtiment à usage administratif clos servant à loger des personnes condamnées à une peine privative ou en instance de jugement
alternative label: centre de rétention
alternative label: gaol @en
preferred label: jail @en

promontoire
type: Class
subclass of: sommet de forme pointue
comment: Relief élevé qui domine un autre relief moins élevé, une plaine
alternative label: headland @en
preferred label: promontory @en

puits
type: Class
subclass of: rupture naturelle de relief concave non-linéaire
subclass of: infrastructure de gestion d eau douce
comment: Puits à eau est une installation de captage d eau souterraine
alternative label: well @en
preferred label: water well @en

puy
type: Class
subclass of: sommet de forme arrondie
comment: Mont volcanique ayant une forme arrondie
preferred label: volcano mountain @en

pylône
type: Class
subclass of: infrastructure de transport par câble
subclass of: infrastructure électricité
comment: Support utilisé pour suporter les câbles (lignes éléctriques, remontées mécaniques, etc.)
alternative label: portique
alternative label: poteau
alternative label: utility pole @en
preferred label: pylon @en

pépinière
type: Class
subclass of: plantation
subclass of: végétation arborée
preferred label: nursery @en

quai
type: Class
subclass of: infrastructure de déplacement maritime ou fluvial
alternative label: appontement
alternative label: cale
alternative label: embankment @en
alternative label: embarcadère
alternative label: ponton
alternative label: pontoon @en
alternative label: quay @en
preferred label: wharf @en

quartier
type: Class
subclass of: zone d habitation
preferred label: quarter @en

ravin
type: Class
subclass of: décrochement le long d un axe
subclass of: passage encaissé aux parois abrupte
comment: Entaille assez profonde du sol, le plus souvent en V, produite par les eaux de ruissellement ou par un torrent ou une pente abrupte sous un axe (route, chemin, sentier)
alternative label: ravine
preferred label: gully @en

reculée
type: Class
subclass of: cirque
subclass of: vallée
comment: Vallée courte et profonde creusée en bordure d un plateau calcaire, terminée en amont par un amphithéâtre
preferred label: steephead valley @en

recyclage
type: Class
subclass of: bâtiment et installation industrielle
preferred label: recycling @en

refuge
type: Class
subclass of: hébergement isolé
comment: Construction en zone de montagne ayant le role d héberger les humains et d offrir un certain nombre de services (repas, boissons, etc.).
alternative label: gîte de montagne
alternative label: mountain hostel @en

relief
type: Class
subclass of: objet de repère
comment: Contient tous les termes décrivant les formes de relief naturelles
preferred label: landform @en

remontée mécanique
type: Class
subclass of: infrastructure de transport par câble
comment: Un moyen de transport servant à transporter des passagers constitué de câbles porteurs reposant sur des pylônes
alternative label: remonte pente
alternative label: slope lift @en
preferred label: mechanical lift @en

rempart
type: Class
subclass of: bâtiment militaire
alternative label: city wall @en
alternative label: mur de fortification
preferred label: rampart @en

replat
type: Class
subclass of: plateau adouci de forme compacte
comment: Partie plate située en épaulement sur une pente ou au flanc d un versant
preferred label: flat @en

repère de nivellement
type: Class
subclass of: borne
comment: Un point matérialisé dont l’altitude est connue avec précision
alternative label: levelling point @en
alternative label: vertical control point @en
preferred label: benchmark @en

ressaut
type: Class
subclass of: rupture de pente
comment: Une pente brusque correspondant à un palier entre deux zones relativement plates
alternative label: jump @en

retenue
type: Class
subclass of: plan d eau
is defined by: Comprend les retenues collinaires, Etangs, Mares; http://id.eaufrance.fr/nsa/831
alternative label: forebay @en
alternative label: reservoir @en
alternative label: retenue d eau
alternative label: écréteur de crue
preferred label: pondage @en

retenue collinaire
type: Class
subclass of: retenue
comment: Une retenue permettat de stocker les eaux de pluie ou celles d un ruisseau
preferred label: hillside storage reservoir @en

ride
type: Class
subclass of: rupture de relief convexe issu d érosion
comment: Forme de relief mobile au profil dissymétrique modelée par de l eau en mouvement dans un matériau meuble
alternative label: ripple @en

rimaye
type: Class
subclass of: rupture glacière
comment: Large crevasse ouverte profondément sur le pourtour du névé, entre le rocher et la glace en mouvement

rive
type: Class
subclass of: transition terre
comment: Bande de terre qui borde un cours d eau
alternative label: berge
alternative label: rivage
preferred label: bank @en

rivière
type: Class
subclass of: cours d eau
comment: Cours d eau moyennement abondant qui se jette dans un fleuve, dans la mer ou parfois dans un lac.
preferred label: river @en

rocher
type: Class
subclass of: sommet de forme pointue
alternative label: crag @en
alternative label: roche
preferred label: rock @en

rond point
type: Class
subclass of: carrefour
comment: Place circulaire d où rayonnent plusieus avenues
alternative label: carrefour giratoire
alternative label: traffic circle @en
preferred label: roundabout @en

route
type: Class
subclass of: infrastructure de transport routier
comment: Element du réseau de transport routier (autoroutes, routes à 1 chaussée ou 2 chaussée, bretelle) . Il s agit d une route goudronnée permettant la circulation des véhicules.
preferred label: road @en

rue
type: Class
subclass of: infrastructure de transport routier
alternative label: allée
alternative label: ruelle

ruine
type: Class
subclass of: hébergement isolé
comment: Débris d un batiment d hébérgement ancien ou écroulé. Il est différent d une ruine d un édifice
preferred label: ruin @en

ruisseau
type: Class
subclass of: cours d eau
comment: Un ruisseau est un petit cours d eau peu profond
alternative label: brook @en
alternative label: burn @en
alternative label: nant
alternative label: rieu
alternative label: rif
alternative label: riou
alternative label: riu
alternative label: rivulet @en
alternative label: écoulement naturel
preferred label: stream @en

rupture de relief convexe glacière
type: Class
subclass of: rupture naturelle de relief convexe
comment: Contient des formes de relief qui résultent d un phénomène d origine glacière
preferred label: convex natural relief break glacial @en

rupture de relief convexe issu d éboulement
type: Class
subclass of: rupture naturelle de relief convexe
comment: Contient des formes de relief qui résultent d un phénomène naturel d éboulement
preferred label: convex natural relief break issued from a landslide @en

rupture de relief convexe issu d érosion
type: Class
subclass of: rupture naturelle de relief convexe
comment: Contient des formes de relief qui résultent d un phénomène naturel d érosion d origine rocheuse
preferred label: convex natural relief break issued from a errosion @en

rupture glacière
type: Class
subclass of: rupture naturelle de relief concave linéaire
comment: Contains landforms resulting from a natural erosion process and includes slender landforms of glacial origin @en
comment: Contient des formes de relief qui résultent d un phénomène naturel d érosion et regroupe les formes de relief effilées et d origine glacière
preferred label: glacial break @en

rupture naturelle de relief concave linéaire
type: Class
subclass of: rupture naturelle de relief concave
comment: Contains natural landforms characterized by a distinct, elongated concave form that marks a discontinuity in the terrain. These breaks result from natural processes such as erosion, tectonic activity, or weathering, and exhibit a fractured or rugged profile. They can be prominent or subtle in relief, representing significant morphological anomalies within the landscape @en
comment: Contient des formes de relief naturelles se caractérisant par une discontinuité allongée du terrain présentant un profil concave. Elles résultent de processus naturels tels que l’érosion, l’activité tectonique ou l’altération, et présentent un aspect fracturé ou accidenté. Elles peuvent être plus ou moins marquées dans le relief et constituent des anomalies morphologiques significatives dans le paysage.
preferred label: linear concave natural relief break @en

rupture naturelle de relief convexe
type: Class
subclass of: convexe
comment: Contient des formes de relief de forme convexe qui résultent d un phénomène naturel d érosion ( eau, vent, etc.) et qui peuvent avoir plusieurs origines
preferred label: convex natural relief break @en

rupture naturelle de relief concave non-linéaire
type: Class
subclass of: rupture naturelle de relief concave
comment: Contains rock-origin landforms resulting from a natural erosion process and includes landforms that are locally concentrated @en
comment: Contient des formes de relief d origine rocheuse qui résultent d un phénomène naturel d érosion et regroupe les formes de relief ponctuellement localisées
preferred label: non-linear concave natural relief breaks @en

rupture rocheuse
type: Class
subclass of: rupture naturelle de relief concave linéaire
comment: Contains landforms resulting from a natural erosion process and includes slender landforms of rock origin @en
comment: Contient des formes de relief qui résultent d un phénomène naturel d érosion et regroupe les formes de relief effilées et d origine rocheuse
preferred label: rock break @en

région
type: Class
subclass of: division territoriale administrative
preferred label: region @en

régulation de débit
type: Class
subclass of: noeud hydrographique
comment: Un nœud de réseau non lié à la topologie du réseau en soi, mais associé à un point d intérêt ou à une installation hydrographique, ou à un objet artificiel, qui régule le flux du réseau.
preferred label: flow regulation @en

réserve de chasse
type: Class
subclass of: zone naturelle protégée
preferred label: game reserve @en

réserve naturelle
type: Class
subclass of: zone naturelle protégée
preferred label: nature preserve @en

réservoir
type: Class
subclass of: plan d eau
subclass of: infrastructure de gestion d eau douce
is defined by: Plan d’eau artificiel possédant le plus souvent un usage spécifique. Il comprend les bassins d’élevage piscicole, bassins d’épurations, bassins de décantation, bassins de filtrage, bassins de lagunage, bassins de rétention, bassins ostréicole, cressonnières, excréteurs de crues, réservoirs d’eau à ciel ouvert. Il comprend également les bassins d orage, bassins de stockage incendie. Ces réservoirs ne possèdent pas d’usage irrigation; http://id.eaufrance.fr/nsa/831
alternative label: bassin
alternative label: forebay @en
alternative label: pondage @en
preferred label: reservoir @en

réservoir industriel
type: Class
subclass of: équipement industriel
alternative label: tank @en
preferred label: cistern @en

rétrécissement du débit
type: Class
subclass of: noeud hydrographique
comment: Un nœud de réseau qui n est pas lié à la topologie du réseau en soi, mais qui est associé à un point d intérêt ou à une installation hydrographique, ou à un objet artificiel, qui affecte le flux du réseau.
preferred label: flow constriction @en

SAE
type: Class
subclass of: équipement sportif
alternative label: Artificial climbing walls @en
alternative label: Structures Artificielles d’Escalade
preferred label: climbing indoor @en

salle de spectacle
type: Class
subclass of: bâtiment culturel
comment: Bâtiment destiné à recevoir des représentations de spectacles vivants
preferred label: auditorium
alternative label: cinema @en
alternative label: cinéma
alternative label: theater @en
alternative label: théatre

secours en montagne
type: Class
subclass of: bâtiment administratif
comment: Bâtiment offrant des services de recherche et de sauvetage en zone de montagne
preferred label: mountain rescue @en

secteur
type: Class
subclass of: zonage
comment: Zone particulière en montagne définie soit par ses caratéristiques saillantes (pentue, plate, rocheuse) soit par son usage (vocation à réaliser une activité sportive)
preferred label: area @en

secteur couvert
type: Class
subclass of: secteur
comment: Zone couverte par un couvert végétal
preferred label: cover area @en

site de décollage parapente
type: Class
subclass of: équipement sport de nature
comment: Zone délimitée pour le décollage de parapente
preferred label: paragliding take-off area @en

secteur découvert
type: Class
subclass of: secteur
comment: Zone découverte i.e. sans couvert végétal
preferred label: discovered area @en

secteur enneigé
type: Class
subclass of: secteur
comment: Zone où il y a de la neige
preferred label: snow-covered area @en

secteur ensoleillé
type: Class
subclass of: secteur
comment: Zone ensoleillé est une zone éclairée par le soleil
preferred label: sunny area @en

secteur ombragé
type: Class
subclass of: secteur
comment: Zone ombragée est une zone située à l ombre
preferred label: shaded area @en

secteur pentue
type: Class
subclass of: secteur
comment: Zone de forte pente
preferred label: steep area @en

secteur plat
type: Class
subclass of: secteur
comment: Zone d altitude plus au moins constante
preferred label: flat area @en

secteur rocheux
type: Class
subclass of: secteur
comment: Zone couverte ou formée de rochers
preferred label: rocky area @en

selle
type: Class
subclass of: relief
comment: Contient des formes de relief sous forme de selle de cheval; à revoir la définition car ce n est pas toujours sous la forme d une selle de cheval
preferred label: saddle @en

sentier
type: Class
subclass of: voie de communication non carrossable
comment: Voie étroite ne permettant pas le passage de véhicules automobiles. Un sentier peut être revetu ou non.
alternative label: allée
alternative label: allée piétonne
alternative label: footpath @en
alternative label: footway @en
alternative label: layon
alternative label: sente
alternative label: sentier équestre
alternative label: trail @en
alternative label: walkway @en
preferred label: path @en

serre
type: Class
subclass of: équipement agricole
alternative label: glass-house @en
preferred label: greenhouse @en

silo
type: Class
subclass of: équipement agricole
alternative label: cuve à vin
alternative label: réservoir agricole
preferred label: fertilizer tank @en

siphon
type: Class
subclass of: cours d eau
comment: Conduit naturel noyé ou rempli d eau

site de canyoning
type: Class
subclass of: équipement sport de nature
comment: Site équipé pour la pratique du cayoning
preferred label: canyoning site @en

site de fouilles
type: Class
subclass of: vestige
comment: Lieu où sont préservées des preuves de l activité passée
alternative label: Vestige archéologique
alternative label: digs @en
alternative label: excavation @en
preferred label: archaeological site @en

site de spéléologie
type: Class
subclass of: équipement sport de nature
comment: Site équipé pour la pratique de la spéléologie
preferred label: potholing site @en

site de vol libre
type: Class
subclass of: équipement sport de nature
preferred label: Site équipé pour la pratique du vol libre @en
preferred label: hang-gliding site @en

snow park
type: Class
subclass of: équipement sport de nature
comment: Un snow park est un site enneigé aménagé pour la pratique du snowtrott, snowboard et du ski freestyle.
preferred label: snowpark @en

sommet
type: Class
subclass of: convexe
comment: Point le plus élevé d une forme de relief
alternative label: antécime
alternative label: bric
alternative label: cime
alternative label: montagne
alternative label: mountain @en
alternative label: pointe
alternative label: sommité
preferred label: summit @en

sommet de forme arrondie
type: Class
subclass of: sommet
comment: Regroupe des sommets de forme arrondis
preferred label: rounded-shaped summit @en

sommet de forme pointue
type: Class
subclass of: sommet
comment: Regroupe des sommets de forme pointue
preferred label: pointed-shaped summit @en

source
type: Class
subclass of: noeud hydrographique
comment: Point d émergence à la surface du sol de l eau d une série de portions du réseau hydrographique interconnectés.
alternative label: exsurgence
alternative label: outcropping @en
alternative label: puisard
alternative label: resurgence @en
alternative label: résurgence

sports en eaux vives
type: Class
subclass of: équipement sport de nature
comment: Centre, école, club, base fixe et infrastructure conséquente où peuvent se pratiquer certains sports en eaux vives. Exemples: canoë-kayak, hydrospeed, rafting, sports en eaux vives (spec de la bdtopo)

spot de slackline
type: Class
subclass of: équipement sport de nature
comment: La slackline ou slack est une pratique sportive s apparentant au funambulisme
preferred label: slackline_spot @en

station de pompage
type: Class
subclass of: infrastructure de gestion d eau douce
alternative label: captage
alternative label: prise d eau
alternative label: water catchment @en
preferred label: pumping station @en

station de taxi
type: Class
subclass of: infrastructure de transport routier
comment: Lieu aménagé pour recevoir les taxis
preferred label: taxi station @en

station météorologique
type: Class
subclass of: équipement scientifique et technique
alternative label: meteorological station @en
alternative label: station météo
preferred label: weather station @en

station scientifique
type: Class
subclass of: équipement scientifique et technique
preferred label: scientific station @en

statue
type: Class
subclass of: monument
comment: Ouvrage de sculpture représentant un être vivant ou une scène.

statue de la Vierge
type: Class
subclass of: monument religieux
comment: Statue représentant la Vierge Marie
alternative label: statue of the Madonna @en
alternative label: vierge
preferred label: Virgin Mary statue @en

stèle
type: Class
subclass of: monument
comment: Monument monolithe qui porte une inscription ou des ornements sculptés
preferred label: stele @en

supermarché
type: Class
subclass of: bâtiment commercial
comment: Bâtiment de grande surface réservé à des activités commerciales
alternative label: centre commercial
alternative label: hypermarché
alternative label: hypermarket @en
preferred label: supermarket @en

surface neige et glace
type: Class
subclass of: hydrographie
comment: Terrains couverts en permanence de neige ou de glace (CNIG)

surplomb
type: Class
subclass of: verticale
comment: Partie supérieure d une roche, d une masse qui fait saillie, qui s avance
preferred label: overhang @en

synagogue
type: Class
subclass of: lieu de culte
preferred label: synaguoge @en

sérac
type: Class
subclass of: rupture de relief convexe glacière
comment: Fortes irrégularités de la surface du glacier séparées par des crevasses résultant de la fracturation de la glace dans les secteurs à forte pente et se poursuivant sur la langue par une disposition chaotique de blocs et de pyramides de dimensions diverses
comment: Le sérac est un bloc de glace de grande taille formé par la fracturation d un glacier
preferred label: serac @en

talus
type: Class
subclass of: rupture de pente
comment: Terrain, partie du sol en pente; aspect lisse;
preferred label: embankment @en

tapis roulant industriel
type: Class
subclass of: équipement industriel
preferred label: industrial conveyor belt @en

tapis skiable
type: Class
subclass of: remontée mécanique
comment: Un type de remontée mécanique, en général sur des pente faibles et courtes et de faible vitesse @en
preferred label: ski carpet @en

temple
type: Class
subclass of: lieu de culte

temple bouddhiste
type: Class
subclass of: temple
preferred label: buddhist temple @en

temple hindouiste
type: Class
subclass of: temple
preferred label: hindu temple @en

temple protestant
type: Class
subclass of: temple
preferred label: protestant temple @en

terrain de football
type: Class
subclass of: terrain de sport
alternative label: football field @en
preferred label: football ground @en

terrain de golf
type: Class
subclass of: terrain de sport
alternative label: golf
alternative label: golf-course @en
alternative label: golf-links @en
preferred label: golf course @en

terrain de manoeuvre
type: Class
subclass of: zone militaire
preferred label: drill-ground @en

terrain de rugby
type: Class
subclass of: terrain de sport
alternative label: rugby field @en
preferred label: rugby ground @en

terrain de sport
type: Class
subclass of: équipement sportif
preferred label: sports-ground @en

terrasse
type: Class
subclass of: plateau adouci de forme allongée
comment: Replat d un versant formé par l érosion, par les fluctuations du niveau d un fleuve, de la mer, d un lac.
preferred label: terrace @en

thalweg
type: Class
subclass of: passage encaissé aux parois peu abrupte
comment: Ligne d intersection des deux pentes latérales d une vallée.
alternative label: talweg
alternative label: valley line @en

toit
type: Class
subclass of: surplomb
comment: Surplomb perpendiculaire à la paroi
preferred label: roof @en

torrent
type: Class
subclass of: cours d eau

tour
type: Class
subclass of: bâtiment militaire
alternative label: beffroi
alternative label: donjon
preferred label: tower @en

tour de contrôle
type: Class
subclass of: infrastructure de déplacement aérien
preferred label: control tower @en

tour de télécommunication
type: Class
subclass of: infrastructure téléphonie mobile
preferred label: telecommunication tower @en

tourbière
type: Class
subclass of: milieu humide
comment: Une petite étendue d eau caractérisée par la présence de matières organique mortes accumulées pour former une turbe
alternative label: peat bog @en
preferred label: bog @en

tranchée
type: Class
subclass of: passage encaissé aux parois abrupte
comment: Entaille pratiquée dans le sol
alternative label: shelter-trench @en
alternative label: trench @en
preferred label: ditch @en

transition terre
type: Class
subclass of: hydrographie
comment: Lieu dans le voisinage de la mer ou d un cours d eau ayant comme vocation la pratique d un sport, d un loisir, voir une vocation d hébergement
preferred label: land transition @en

trouée
type: Class
subclass of: ouverture dans la végétation
alternative label: fire-break @en
alternative label: pare-feu
preferred label: clearing @en

tumulus
type: Class
subclass of: vestige
comment: Tertre artificiel élevé au-dessus d une tombe.
alternative label: barrow @en
alternative label: burial mound @en
alternative label: sepulchral mound @en

tunnel
type: Class
subclass of: franchissement
comment: Galerie souterraine pratiquée pour donner passage à une voie de communication

tyrolienne
type: Class
subclass of: remontée mécanique
comment: Moyen de transport pour les personnes permettant entraînement physique, l activité de passage d obstacles en sport de plein air, activité de loisir (i.e. acrobranche)
preferred label: zip line @en

télécabine
type: Class
subclass of: remontée mécanique
comment: Moyen de transport constitué de câbles porteurs et équipé de cabines fermées
alternative label: gondola @en
alternative label: telpher @en
alternative label: télébenne
alternative label: téléphérique
preferred label: cable car @en

télésiège
type: Class
subclass of: remontée mécanique
comment: Moyen de transport constitué de câbles porteurs et équipé de sièges suspendus à intervalles réguliers
preferred label: chair lift @en

téléski
type: Class
subclass of: remontée mécanique
comment: Moyen de transport constitué de câbles et équipé de perches
preferred label: ski lift @en

université
type: Class
subclass of: établissement d enseignement
alternative label: college @en
alternative label: grande école
preferred label: university @en

usine
type: Class
subclass of: bâtiment et installation industrielle
alternative label: atelier
alternative label: blast furnace @en
alternative label: fabrique
alternative label: factory @en
alternative label: flowr-mill @en
alternative label: haut fourneau
alternative label: manufacture
alternative label: minoterie
alternative label: raffinerie
alternative label: refinery @en
alternative label: sawmill @en
alternative label: scierie
alternative label: works @en
preferred label: plant @en

val
type: Class
subclass of: vallée
comment: Dépression allongée et évasée correspondant à un synclinal, dans le relief de type jurassien
preferred label: narrow valley @en

vallon
type: Class
subclass of: vallée
comment: Petite dépression allongée entre deux collines, deux coteaux, deux hauteurs
alternative label: dingle @en
alternative label: small valley @en
preferred label: dell @en

vallée
type: Class
subclass of: dépression ouverte
comment: Dépression allongée, plus ou moins évasée, formée par un cours d eau ou un glacier
preferred label: valley @en

vasque
type: Class
subclass of: cours d eau
comment: Lieu d origine naturelle circulaire ou élliptique remplit de l eau. Il se situe dans un ruisseau, torrent, etc.
preferred label: bowl @en

verger
type: Class
subclass of: plantation
subclass of: végétation arborée
preferred label: orchard @en

versant
type: Class
subclass of: pente
comment: Dans une vallée, surface topographique comprise entre le faîte d un relief et le thalweg voisin
alternative label: adret
alternative label: ubac
preferred label: side @en

verticale
type: Class
subclass of: planaire
comment: Regroupe des éléments du relief dont la forme tend vers la verticalité
preferred label: vertical @en

vestige
type: Class
subclass of: élément du patrimoine
comment: Element du patrimoine qui demeure à travers le temps.
preferred label: archeological ruins @en

via ferrata
type: Class
subclass of: équipement sport de nature
comment: Site équipé pour la pratique de la via ferrata

vigne
type: Class
subclass of: plantation
subclass of: végétation basse
preferred label: vineyard @en

village
type: Class
subclass of: division territoriale administrative

village de vacances
type: Class
subclass of: hébergement accessible
comment: Ensemble d hébergements collectifs destiné à accueillir des personnes pour effectuer des activités touristiques ou de loisirs
alternative label: camp de vacances
alternative label: colonie de vacances
alternative label: holiday camp @en
alternative label: summer camp @en
preferred label: holiday village @en

ville
type: Class
subclass of: division territoriale administrative
alternative label: banlieue
alternative label: suburb @en
preferred label: town @en

vire
type: Class
subclass of: plateau adouci de forme allongée
comment: Replat étroit le long d un escarpement montagneux.
preferred label: flat @en

voie TGV
type: Class
subclass of: voie ferrée
comment: Voie ferrée à grande vitesse
preferred label: ultra-high speed railway @en

voie antique
type: Class
subclass of: vestige
comment: Voie du réseau routier de l époque antique.
preferred label: roman road @en

voie de communication non carrossable
type: Class
subclass of: infrastructure de déplacement terrestre
comment: Infrastructure routière ne permettant pas la circulation des véhicules motorisés.
alternative label: not metalled road @en
preferred label: impassable road @en

voie ferrée
type: Class
subclass of: infrastructure de transport ferré
comment: Chemin de roulement constitué par une ou deux files de rails parallèles fixés sur des traverses et sur lequel circulent les métros, les trains, les tramways.
alternative label: chemin de fer
alternative label: rail @en
alternative label: railway @en
alternative label: railway line @en
alternative label: railway track @en
alternative label: track @en
alternative label: voie de tramway
alternative label: voie de triage
preferred label: rail road @en

voie ferrée à crémaillère
type: Class
subclass of: voie ferrée
comment: Une voie ferrée qui dispose en son centre d un rail supplémentaire denté permettant la circulation des trains
preferred label: track-railway @en

voie funiculaire
type: Class
subclass of: voie ferrée
comment: Chemin de fer destiné à gravir de très fortes rampes et dont les convois sont mus par un câble.
alternative label: cable-railway @en
alternative label: funicular railway @en
preferred label: funicular @en

volcan
type: Class
subclass of: sommet de forme arrondie
comment: Orifice naturel par lequel un réservoir de magma à haute température d origine profonde communique avec la surface de la terre et s y répand; relief montagneux de forme conique formé par l accumulation des produits rejetés, montés par la cheminée dans le cratère au cours d éruptions
preferred label: volcano @en

végétation arborée
type: Class
subclass of: végétale
comment: Végétation constituée d arbres ou interruptions au sein d une zone arborée (clairière, trouée)
preferred label: wooded area @en

végétation basse
type: Class
subclass of: végétale
comment: Végétation de petite taille
alternative label: zone arbustive
preferred label: low vegetation @en

vélodrome
type: Class
subclass of: piste de sport
alternative label: bicycle racetrack @en
preferred label: cycle-racing track @en

zonage
type: Class
subclass of: objet de repère
comment: Contient les délimitations immatérielles du territoire. Ces délimitations peuvent-être de fait (agglomération) ou de jure (commune, zone industrielle). Les marqueurs matériels de ces délimitations sont dans la catégorie "construction"
preferred label: land subdivision @en

zone militaire
type: Class
subclass of: zonage
comment: Délimitation de fait ou légale d une zone pouvant accueillir des activités militaires
alternative label: military reservation @en
alternative label: terrain militaire
preferred label: military area @en

zone naturelle protégée
type: Class
subclass of: zonage
comment: Délimitation légale d une zone de projection de l environnement
preferred label: protected natural zone @en

éboulis
type: Class
subclass of: rupture de relief convexe issu d éboulement
comment: toujours en activités contrairement à un pierrier @en
alternative label: raillère

échangeur
type: Class
subclass of: carrefour
comment: Intersection routière à plusieurs niveaux
alternative label: clover-leaf @en
preferred label: interchange @en

écluse
type: Class
subclass of: infrastructure de déplacement maritime ou fluvial
alternative label: ascenseur à bateaux
alternative label: bajoyer
alternative label: bassin d écluse
alternative label: cale sèche
alternative label: canal lift @en
alternative label: dry dock @en
alternative label: radoub
preferred label: lock @en

écurie
type: Class
subclass of: installation d élevage
comment: L écurie est le bâtiment, et éventuellement l enclos réservé aux chevaux
alternative label: haras
alternative label: ranch @en
alternative label: stud farm @en
preferred label: horse stable @en

église
type: Class
subclass of: lieu de culte
alternative label: abbatiale
alternative label: basilica @en
alternative label: basilique
alternative label: collégiale
alternative label: steeple @en
preferred label: church @en

égout
type: Class
subclass of: cours d eau artificiel
alternative label: waste water disposal @en
preferred label: sewer @en

élément de jonction de plans
type: Class
subclass of: convexe
comment: Regroupe des éléments de plans de montagne qui se retrouve en quelques sorte à l intersection des plans. Ces éléments peuvent se situer à des endroits à faible inclinaison ou à des intersections aiguës et ponctuelles, et marquent souvent des transitions ou des connexions naturelles dans le paysage. Ce lieu d intersection peut être de pente douce ou bien effilé
preferred label: element of tapered plane junction @en

élément dejonction de plans éfillé
type: Class
subclass of: élément de jonction de plans
comment: Regroupe des éléments de plans de montagne qui se retrouve en quelques sorte à l intersection des plans. Ce lieu d intersection a une forme effilée (douceur de forme effilée)
preferred label: Element of tapered plane junction @en

élément du patrimoine
type: Class
subclass of: construction
comment: Constructions à valeur historique
preferred label: cultural heritage feature @en

éolienne
type: Class
subclass of: équipement industriel
preferred label: wind pump @en

épaule
type: Class
subclass of: élément dejonction de plans doux
comment: Objet situé sous un sommet présentant un replat sommital
alternative label: épaulement
preferred label: shoulder of the mountain @en

éperon
type: Class
subclass of: élément dejonction de plans éfillé
comment: Partie saillante, avancée d un relief montagneux
preferred label: spur @en

équipement agricole
type: Class
subclass of: bâtiment et installation agricole
preferred label: farm equipment @en

équipement de montagne
type: Class
subclass of: équipement de protection
preferred label: mountain equipment @en

équipement de protection
type: Class
subclass of: infrastructure service
alternative label: protective equipment @en

équipement de protection du réseau routier
type: Class
subclass of: équipement de protection
preferred label: road network protection equipment @en

équipement de protection hydrographique
type: Class
subclass of: infrastructure eau

équipement industriel
type: Class
subclass of: bâtiment et installation industrielle
preferred label: industrial equipment @en

équipement scientifique et technique
type: Class
subclass of: infrastructure service
preferred label: scientific and technological feature @en

équipement sport de nature
type: Class
subclass of: équipement sportif
comment: Equipement permettant la pratique de sports de nature principalement en zone de montagne
preferred label: outdoor sport equipment @en

équipement sportif
type: Class
subclass of: infrastructure sport et loisirs
preferred label: sports facility @en

étable
type: Class
subclass of: installation d élevage
preferred label: barn @en

établissement de santé
type: Class
subclass of: bâtiment et installation
preferred label: healthcare facility @en

étang
type: Class
subclass of: retenue
comment: Une étandue d eau assez grande, plus ou moins stagnante, artificielle ou naturelle.
preferred label: pond @en

île
type: Class
subclass of: transition terre
comment: Étendue de terre ferme émergée d une manière durable dans les eaux.
alternative label: isle @en
alternative label: islet @en
preferred label: island @en

aire d autoroute
type: Class
subclass of: infrastructure de transport routier
comment: Structure aménagée en bordure d autoroute prposant différentes services (repos, ravitaillement, etc.)
alternative label: aire de repos
alternative label: aire de service
alternative label: service area @en
preferred label: rest area @en

borne d incendie
type: Class
subclass of: borne
comment: Borne indiquant la bouche d incendie
preferred label: fire hydtrant @en

bâtiment d habitation
type: Class
subclass of: bâtiment et installation
comment: Batiment ayant le rôle d héberger les humains. A le rôle de résidence prinicipale ou secondaire
preferred label: residential feature @en

bâtiment d hébergement
type: Class
subclass of: bâtiment et installation
comment: Bâtiment ayant le rôle d héberger ou d habriter des visiteurs pour une durée limitée. Il n a pas de rôle de résidence secondaire ou principale
preferred label: accomodation building @en

bâtiment d information
type: Class
subclass of: bâtiment et installation
comment: Bâtiment ayant comme vocation d accueillir du public pour l information de la pratique des sports et des loisirs
preferred label: information building @en

canal d irrigation
type: Class
subclass of: cours d eau artificiel
alternative label: bief
alternative label: bisse
alternative label: béal
alternative label: rigole
alternative label: roubine
preferred label: irrigation channel @en

centre d interprétation
type: Class
subclass of: musée
comment: Un type de musée dont le projet muséal ne se fonde pas sur l existence d une collection mais qui a le rôle de présenter un patrimoine, que ce soit un paysage, un territoire, un site, des vestiges ou encore un monument, ou même une histoire.
preferred label: interpretation center @en

chalet d alpage
type: Class
subclass of: hébergement isolé
comment: Bâtiment isolé, situé en montagne, utilisé traditionnellement de façon saisonnière pour abriter l’homme et le bétail
preferred label: alpine chalet @en

chambre d hôtes
type: Class
subclass of: hébergement accessible
comment: Un type d hébergement meublé (chambre) aménagé avec une salle de bain privative loué et loué par des visiteurs. Sa location se fait à la nuit.
alternative label: bed and breakfast @en
alternative label: maison d hôtes
preferred label: guest rooms @en

château d eau
type: Class
subclass of: bâtiment remarquable
subclass of: infrastructure de gestion d eau douce
comment: Réservoir d’eau construit en hauteur pour surélever le niveau de l’eau par rapport aux constructions environnantes et destiné à l alimentation en eau d une collectivité.
preferred label: water tower @en

cours d eau
type: Class
subclass of: hydrographie
comment: Un écoulement d’eaux courantes dans un lit naturel à l’origine, alimenté par une source et présentant un débit suffisant la majeure partie de l’année » (CE. SSR. 21 octobre 2011, Ministre de l’écologie c. EARL Cintrat, n° 334322, publiée au Recueil).
preferred label: watercourse @en

cours d eau artificiel
type: Class
subclass of: infrastructure de transport d eau
preferred label: artificial waterway @en

infrastructure de gestion d eau douce
type: Class
subclass of: infrastructure eau
preferred label: fresh water catchment infrastructure @en

infrastructure de transport d eau
type: Class
subclass of: infrastructure eau
preferred label: water transport @en

installation d aquaculture
type: Class
subclass of: installation d élevage
preferred label: aquaculture @en

installation d élevage
type: Class
subclass of: bâtiment et installation agricole
alternative label: cattle ranch @en
alternative label: livestock building @en
alternative label: livestock facility @en
alternative label: poultry farm @en
alternative label: ranch @en
alternative label: stable @en
preferred label: animal farm @en

nappe d eau
type: Class
subclass of: plan d eau
is defined by: Plan d’eau artificiel possédant le plus souvent un usage spécifique. Il comprend les bassins d’élevage piscicole, bassins d’épurations, bassins de décantation, bassins de filtrage, bassins de lagunage, bassins de rétention, bassins ostréicole, cressonnières, excréteurs de crues, réservoirs d’eau à ciel ouvert. Il comprend également les bassins d orage, bassins de stockage incendie. Ces réservoirs ne possèdent pas d’usage irrigation. http://id.eaufrance.fr/nsa/831
alternative label: basin @en
alternative label: bassin
alternative label: gour
alternative label: plan d eau de gravière
preferred label: body of water @en

parc d attraction
type: Class
subclass of: parc de loisir
comment: Infrastructure permettant la pratique de loisirs de formes diverses (montagnes russes, toboggans, terrain de jeux, etc.)
alternative label: amusement grounds @en
preferred label: amusement park @en

piste d athlétisme
type: Class
subclass of: piste de sport
alternative label: bridle path @en
alternative label: track @en
preferred label: running track @en

altisurface
type: Class
subclass of: infrastructure de déplacement aérien
alternative label: taxiway @en
preferred label: piste d aviation
preferred label: runway @en

site d atterrissage parapente
type: Class
subclass of: équipement sport de nature
comment: Zone délimitée pour l atterissage de parapente
preferred label: paragliding landing area @en

secteur d avalanche
type: Class
subclass of: secteur
comment: Zone où des avalanches se sont produites ou zone où le risque d avalanche est important
preferred label: avalanche area @en

site d escalade
type: Class
subclass of: équipement sport de nature
comment: Site équipé pour la pratique de l escalade
alternative label: artificial climbing wall @en
alternative label: climbing outdoor @en
alternative label: climbing rock @en
alternative label: mur d escalade artificiel
alternative label: rocher d escalade
preferred label: rock climbing place @en

station d épuration
type: Class
subclass of: infrastructure de traitement des eaux
comment: Installation destinée à épurer les eaux usées domestiques ou industrielles et les eaux pluviales avant le rejet dans le milieu nature. L eau n est pas potable (réf Hygiene-publique.gov.fr)
alternative label: bassin de décantation
alternative label: bassin de filtrage
alternative label: bassin de lagunage
preferred label: water treatment plant @en

station de sports d hiver
type: Class
subclass of: quartier
alternative label: domaine skiable
alternative label: station
alternative label: station de ski
alternative label: winter sport resort @en
preferred label: resort @en

station de traitement d eau potable
type: Class
subclass of: infrastructure de traitement des eaux
comment: Station de traitement de l eau dont le but est de rendre l eau potable conforme aux normes de potabilité (Réf. Hygiene-publique.gov.fr)
preferred label: drinking water treatment plant @en

table d orientation
type: Class
subclass of: infrastructure sport et loisirs
comment: Construction à vocation touristique située dans un point culminant et indiquant les éléments vus depuis le point de vue panoramique
preferred label: orientation table @en

terrain d aviation
type: Class
subclass of: infrastructure de déplacement aérien
alternative label: aerodrome @en
alternative label: altiport @en
alternative label: aérodrome
alternative label: hélistation
preferred label: airfield @en

tourne d avalanche
type: Class
subclass of: pare-avalanche
preferred label: avanlanche turn @en

zone d activité
type: Class
subclass of: zonage
comment: Délimitation de fait ou légale d une zone contenant principalement des activités éconnomiques
alternative label: industrial estate @en
alternative label: industrial park @en
alternative label: parc d activité
alternative label: zone artisanale
alternative label: zone commerciale
alternative label: zone industrielle
preferred label: business area @en

zone d habitation
type: Class
subclass of: zonage
comment: Délimitation de fait d une zone contenant un ou plusieurs batiments d habitation
preferred label: built-up area @en

établissement d enseignement
type: Class
subclass of: bâtiment et installation
alternative label: elemetnary school @en
alternative label: kindergarten @en
alternative label: maternelle
alternative label: nursery school @en
alternative label: primary education school @en
alternative label: primary school @en
alternative label: school @en
alternative label: école
alternative label: école primaire
preferred label: elementary school @en

bruyère
type: NamedIndividual

buis
type: NamedIndividual

Feuillus
type: NamedIndividual
type: Composition du peuplement en 3 classes
comment: A stand dominated by deciduous trees, representing over 75% of the relative canopy cover. @en
comment: Espace peuplé d’arbres forestiers composée de plus de 75 % de feuillus (taux de couvert relatif).
label: Deciduous @en

hêtraie
type: NamedIndividual

Mixtes
type: NamedIndividual
type: Composition du peuplement en 3 classes
comment: A mixture of deciduous and coniferous species, with neither representing for more than 75% of the relative canopy cover. @en
comment: Espace peuplé d’arbres forestiers composée d'un mélange de feuillus et de conifères, dans lequel aucun des deux n’atteint 75 %
label: Mixed @en

mélezin
type: NamedIndividual

Résineux
type: NamedIndividual
type: Composition du peuplement en 3 classes
comment: A stand dominated by coniferous trees, representing over 75% of the relative canopy cover. @en
comment: Espace peuplé d’arbres forestiers composée de plus de 75 % de résineux (taux de couvert relatif).
label: Conifers @en
alternative label: Conifères

sapin
type: NamedIndividual